{"text_format":"3","workbook":"xlsx","n_sheets":6,"sheets":["Version History","Application","Calculations","QPLs","Invoice_Optional","Savings and Incentives"],"not_rendered":{"images":5,"macros":1,"external_links":1,"defined_names":91,"comments":3},"read":"whole","date_system":"1900"}

{"sheet":"Version History","index":0,"n_rows":22,"n_cols":4,"rows_kept":22,"hidden":true}
["2021 Comprehensive Lighting Solutions Workbook"]
[]
["Version History"]
["Program Year","Date of Revision","Description of Changes","Updated By:"]
[2020,"2020-07-09","On Savings and Incentive tab, remove $/kWh and fix MMID 5029 final incentive to cap at 50% of project cost. Round / adjust HID lighting options to match Page 41 of Lighting Catalog. ","Melissa"]
[2020,"2020-07-10","Correct R4758 to be per kW controlled (not per motor) and kitchen demand control ventilation measures to require tech review. ","Zach"]
[2020,"2020-11-20","Corrected formula in column Z on the calc tab to reference $E$9 and $G$10 instead of E9 and G10","Melissa"]
[2020,"2020-12-23","Updated exterior control savings factor from 0.4 to 0.5 per approved workpaper in Huddle","Melissa"]
[2020,"2020-12-23","Updated the Application tab to reflect what the catalog application page will look like for 2021","Jeremiah"]
[2020,"2020-12-29","Changed password for protecting sheets to 'focus 2021'; changed # of rows options to 10/50/300/1000; updated 2021 Incentives header","Melissa/Zach"]
[2020,"2020-12-30","Removed '2020 CLS Sell Sheet' that was embedded on Savings and Incentives tab","Melissa"]
[2021,"2021-03-18","Added conditional formatting and an error message to prevent existing hours from being edited if the Annual Run Hours is set to \"Default Sector Hours\".","Zach"]
[2021,"2021-12-22","Removed Project Cost from Calc tab because it is redundant; updated all passwords for 2022","Melissa"]
[2022,"2022-01-03","Added '(either measured or calculated)' on Savings and Incentives tab under footcandles entry; Changed 'MMID' to 'Incentive' on Calc tab cell AC19","Melissa"]
[2022,"2022-01-04","Updated the application tab to have text align with check boxes and reflect changes to 2022 catalog.","Jeremiah"]
[2022,"2022-01-06","Added instruction on how to embed docs on QPL tab","Melissa"]
[2022,"2022-02-22","Unlocked the FEIN cell in the Application tab to allow users to input FEIN. Also, unlocked cell L63 to allow user to enter other type of business classification.","Zishan"]
[2022,"2022-04-01","Added Estimated Annual Cost Savings and Simple Payback w/ and w/o Incentive table to Savings and Incentives tab","Melissa"]
[2022,"2022-09-19","Updated Savings Factors to match updated workpaper for 2023 projects. Updated kW savings formula to include SF values","Melissa"]
[2022,"2022-10-28","Updated default elec rates and added sumif formula to project cost cells on Savings & Incentives tab to refer to Calculations tab; updated password for 2023","Melissa"]
[2022,"2022-12-22","Updated Application tab to reflect changes coming in the 2023 catalog; changed logo on Savings and Incentives page.","Jeremiah"]
[2023,"2023-03-09","Adjusted algorithm saving factors for columns U, V, and W to match TRM","Tad"]

{"sheet":"Application","index":1,"n_rows":64,"n_cols":13,"rows_kept":64,"merged":[[0,0,3,8],[0,9,3,13],[5,0,8,7],[10,0,10,2],[10,8,10,10],[12,0,12,3],[12,8,12,12],[13,0,15,6],[14,8,14,9],[14,10,14,12],[16,0,16,3],[16,4,16,6],[16,8,16,12],[17,4,17,6],[18,8,18,12],[20,8,20,10],[23,8,23,10],[24,1,24,5],[26,0,26,5],[28,0,28,5],[30,0,30,5],[30,11,30,12],[32,0,32,3],[32,9,32,10],[33,9,33,10],[33,11,33,12],[34,0,34,5],[34,8,34,12],[36,4,36,5],[36,8,36,12],[37,0,37,2],[38,8,38,10],[40,0,40,5],[40,8,40,12],[42,0,42,3],[42,4,42,5],[42,8,42,10],[44,0,44,3],[44,4,44,5],[45,8,45,10],[46,8,48,12],[49,0,49,5],[50,8,50,12],[51,0,51,3],[52,8,52,10],[54,0,54,2],[54,8,54,9],[54,11,54,12],[55,11,55,12],[56,0,56,5],[56,11,56,12],[57,9,57,11],[58,0,58,1],[58,2,58,5],[58,8,58,9],[59,8,59,12],[63,3,63,5]]}
["COMPREHENSIVE LIGHTING SOLUTION APPLICATION                                                                                                        FOR PROJECTS COMPLETED BY 12/31/2023",{"$nulls":8},"Note: this workbook needs to be used in the full version of Excel. Some features won't work in Excel Online."]
[]
[]
[]
[]
["COMPLETE ALL SECTIONS. INCOMPLETE APPLICATIONS CANNOT BE PROCESSED AND WILL DELAY PAYMENT OF INCENTIVES. APPLICATIONS MUST BE SUBMITTED WITHIN 60 DAYS OF COMPLETED PROJECT INSTALLATION, NO LATER THAN JANUARY 31, 2024. FOR ADDITIONAL COPIES OF THIS FORM, VISIT FOCUSONENERGY.COM/CATALOGS."]
[]
[]
[]
[]
["section 1",{"$nulls":7},"section 4"]
["ACCOUNT AND CUSTOMER INFORMATION",{"$nulls":7},"TRADE ALLY INFORMATION"]
["TAX IDENTIFICATION NUMBER (Check one.) ",{"$nulls":3},"       FEIN     or","           SSN"]
["IF YOU USE A SOCIAL SECURITY NUMBER (SSN) AS YOUR TAX IDENTIFICATION NUMBER, DO NOT PROVIDE IT BELOW. YOU WILL BE CONTACTED BY THE PROGRAM VIA E-MAIL TO PROVIDE A COPY OF YOUR W-9 USING A SECURE ONLINE PORTAL, IF IT IS NOT ALREADY ON FILE. YOU MUST LIST",{"$nulls":7},"TRADE ALLY CONTACT NAME"]
[]
[{"$nulls":8},"PRIMARY PHONE #",null,"E-MAIL ADDRESS"]
["AN E-MAIL ADDRESS IN SECTION 3. "]
[{"$nulls":4},"FEIN",{"$nulls":3},"TRADE ALLY COMPANY NAME"]
["TAX CLASSIFICATION OF CUSTOMER"]
["(Check one. Required for all businesses, including non-profits.)",{"$nulls":7},"ADDRESS"]
["Sole Proprietorship",null,"Individual",null,"Single Member - LLC"]
["C Corporation",null,"S Corporation",null,"Partnership",{"$nulls":3},"CITY",null,null,"STATE","ZIP"]
["Limited Liability Company - C Corp",{"$nulls":3},"Limited Liability Company - S Corp"]
["Limited Liability Company - Partnership",{"$nulls":7},"section 5"]
["Other:",{"$nulls":7},"BUSINESS PAYMENT INFORMATION"]
[{"$nulls":8},"Payee is responsible for any associated tax consequences."]
[{"$nulls":8},"Make incentive check payable to:"]
["OWNER NAME (REQUIRED IF SSN IS USED AS TAX IDENTIFICATION NUMBER)",{"$nulls":7},"        Customer","              Trade Ally","Other Payee"]
[{"$nulls":8},"If Other Payee is selected, the relationship to the utility account holder"]
["COMPANY NAME",{"$nulls":7},"must be identified below:"]
[{"$nulls":8},"        Tenant","       Building Owner","  Other (specify)"]
["LEGAL ADDRESS (AS SHOWN ON COMPANY W-9)",{"$nulls":7},"For All Payees"]
[{"$nulls":8},"Mail check to:","          Customer Legal Address",null,"Job Site Address"]
["CITY",{"$nulls":3},"STATE","ZIP",{"$nulls":3},"           Trade Ally Address",null,"Alternate Address"]
[]
["WHO DID YOU WORK WITH FROM FOCUS ON ENERGY? (CONTACT NAME)",{"$nulls":7},"COMPANY NAME"]
[]
["section 2",{"$nulls":7},"LEGAL ADDRESS (AS SHOWN ON COMPANY W-9)"]
["JOB SITE INFORMATION"]
["(Refer to your utility bills for account numbers below.)",{"$nulls":7},"CITY",null,null,"STATE","ZIP"]
[]
["JOB SITE BUSINESS NAME",{"$nulls":7},"ATTENTION TO (OPTIONAL)"]
[{"$nulls":8},"For Trade Ally and Other Payees"]
["ELECTRIC UTILITY AT JOB SITE",{"$nulls":3},"ELECTRIC ACCOUNT #",{"$nulls":3},"Trade Allies must be registered with the Program and have a current W-9 "]
["N/A",{"$nulls":3},"N/A",{"$nulls":3},"on file to receive payment."]
["GAS UTILITY AT JOB SITE",{"$nulls":3},"GAS ACCOUNT #",{"$nulls":3},"TAX IDENTIFICATION NUMBER   (Check one.) ",null,null,"  FEIN        or","       SSN"]
["Job Site Address is same as Legal Address",{"$nulls":7},"If you use a Social Security Number (SSN) as your TAX Identification Number, do not provide it below. You will be contacted by the Program via email to provide a copy of your W-9 using a secure online portal, if it is not already on file. You must list an email address below."]
["Job Site Address is different (complete below.)"]
[]
[]
["JOB SITE ADDRESS"]
[{"$nulls":8},"FEIN"]
["CITY",{"$nulls":3},"STATE","ZIP",null,null,"Tax Classification of Payee"]
[{"$nulls":8},"(Check one. Required for all businesses, including non-profits.)"]
["section 3",{"$nulls":7},"         Sole Proprietorship",null,"   Individual","          Single-Member LLC"]
["CUSTOMER CONTACT INFORMATION",{"$nulls":7},"          C Corporation",null,"   S Corporation","               Partnership"]
[{"$nulls":8},"  LLC - C Corp",null,"   LLC - S Corp","               LLC - Partnership"]
["JOB SITE CUSTOMER CONTACT NAME",{"$nulls":7},"         Other"]
[{"$nulls":8},"Payee Contact Information"]
["PRIMARY PHONE #",null,"E-MAIL ADDRESS"]
["         I opt in to receive program updates via text message.",{"$nulls":7},"NAME",null,"EMAIL ADDRESS"]
["Preferred method of contact:",null,"Call","           E-mail","        Text"]
["If Focus on Energy has a question about this application, we should contact:"]
["         Customer","         Trade Ally","Other"]

{"sheet":"Calculations","index":2,"n_rows":1541,"n_cols":47,"rows_kept":1541,"merged":[[17,1,17,9],[17,10,17,16],[17,17,17,19],[17,20,17,25],[17,26,17,30],[17,31,17,32],[17,33,17,35],[18,33,18,35],[19,33,19,35],[20,33,20,35],[21,33,21,35],[22,33,22,35],[23,33,23,35],[24,33,24,35],[25,33,25,35],[26,33,26,35],[27,33,27,35],[28,33,28,35],[29,33,29,35],[30,33,30,35],[31,33,31,35],[32,33,32,35],[33,33,33,35],[34,33,34,35],[35,33,35,35],[36,33,36,35],[37,33,37,35],[38,33,38,35],[39,33,39,35],[40,33,40,35],[41,33,41,35],[42,33,42,35],[43,33,43,35],[44,33,44,35],[45,33,45,35],[46,33,46,35],[47,33,47,35],[48,33,48,35],[49,33,49,35],[50,33,50,35],[51,33,51,35],[52,33,52,35],[53,33,53,35],[54,33,54,35],[55,33,55,35],[56,33,56,35],[57,33,57,35],[58,33,58,35],[59,33,59,35],[60,33,60,35],[61,33,61,35],[62,33,62,35],[63,33,63,35],[64,33,64,35],[65,33,65,35],[66,33,66,35],[67,33,67,35],[68,33,68,35],[69,33,69,35],[70,33,70,35],[71,33,71,35],[72,33,72,35],[73,33,73,35],[74,33,74,35],[75,33,75,35],[76,33,76,35],[77,33,77,35],[78,33,78,35],[79,33,79,35],[80,33,80,35],[81,33,81,35],[82,33,82,35],[83,33,83,35],[84,33,84,35],[85,33,85,35],[86,33,86,35],[87,33,87,35],[88,33,88,35],[89,33,89,35],[90,33,90,35],[91,33,91,35],[92,33,92,35],[93,33,93,35],[94,33,94,35],[95,33,95,35],[96,33,96,35],[97,33,97,35],[98,33,98,35],[99,33,99,35],[100,33,100,35],[101,33,101,35],[102,33,102,35],[103,33,103,35],[104,33,104,35],[105,33,105,35],[106,33,106,35],[107,33,107,35],[108,33,108,35],[109,33,109,35],[110,33,110,35],[111,33,111,35],[112,33,112,35],[113,33,113,35],[114,33,114,35],[115,33,115,35],[116,33,116,35],[117,33,117,35],[118,33,118,35],[119,33,119,35],[120,33,120,35],[121,33,121,35],[122,33,122,35],[123,33,123,35],[124,33,124,35],[125,33,125,35],[126,33,126,35],[127,33,127,35],[128,33,128,35],[129,33,129,35],[130,33,130,35],[131,33,131,35],[132,33,132,35],[133,33,133,35],[134,33,134,35],[135,33,135,35],[136,33,136,35],[137,33,137,35],[138,33,138,35],[139,33,139,35],[140,33,140,35],[141,33,141,35],[142,33,142,35],[143,33,143,35],[144,33,144,35],[145,33,145,35],[146,33,146,35],[147,33,147,35],[148,33,148,35],[149,33,149,35],[150,33,150,35],[151,33,151,35],[152,33,152,35],[153,33,153,35],[154,33,154,35],[155,33,155,35],[156,33,156,35],[157,33,157,35],[158,33,158,35],[159,33,159,35],[160,33,160,35],[161,33,161,35],[162,33,162,35],[163,33,163,35],[164,33,164,35],[165,33,165,35],[166,33,166,35],[167,33,167,35],[168,33,168,35],[169,33,169,35],[170,33,170,35],[171,33,171,35],[172,33,172,35],[173,33,173,35],[174,33,174,35],[175,33,175,35],[176,33,176,35],[177,33,177,35],[178,33,178,35],[179,33,179,35],[180,33,180,35],[181,33,181,35],[182,33,182,35],[183,33,183,35],[184,33,184,35],[185,33,185,35],[186,33,186,35],[187,33,187,35],[188,33,188,35],[189,33,189,35],[190,33,190,35],[191,33,191,35],[192,33,192,35],[193,33,193,35],[194,33,194,35],[195,33,195,35],[196,33,196,35],[197,33,197,35],[198,33,198,35],[199,33,199,35],[200,33,200,35],[201,33,201,35],[202,33,202,35],[203,33,203,35],[204,33,204,35],[205,33,205,35],[206,33,206,35],[207,33,207,35],[208,33,208,35],[209,33,209,35],[210,33,210,35],[211,33,211,35],[212,33,212,35],[213,33,213,35],[214,33,214,35],[215,33,215,35],[216,33,216,35],[217,33,217,35],[218,33,218,35],[219,33,219,35],[220,33,220,35],[221,33,221,35],[222,33,222,35],[223,33,223,35],[224,33,224,35],[225,33,225,35],[226,33,226,35],[227,33,227,35],[228,33,228,35],[229,33,229,35],[230,33,230,35],[231,33,231,35],[232,33,232,35],[233,33,233,35],[234,33,234,35],[235,33,235,35],[236,33,236,35],[237,33,237,35],[238,33,238,35],[239,33,239,35],[240,33,240,35],[241,33,241,35],[242,33,242,35],[243,33,243,35],[244,33,244,35],[245,33,245,35],[246,33,246,35],[247,33,247,35],[248,33,248,35],[249,33,249,35],[250,33,250,35],[251,33,251,35],[252,33,252,35],[253,33,253,35],[254,33,254,35],[255,33,255,35],[256,33,256,35],[257,33,257,35],[258,33,258,35],[259,33,259,35],[260,33,260,35],[261,33,261,35],[262,33,262,35],[263,33,263,35],[264,33,264,35],[265,33,265,35],[266,33,266,35],[267,33,267,35],[268,33,268,35],[269,33,269,35],[270,33,270,35],[271,33,271,35],[272,33,272,35],[273,33,273,35],[274,33,274,35],[275,33,275,35],[276,33,276,35],[277,33,277,35],[278,33,278,35],[279,33,279,35],[280,33,280,35],[281,33,281,35],[282,33,282,35],[283,33,283,35],[284,33,284,35],[285,33,285,35],[286,33,286,35],[287,33,287,35],[288,33,288,35],[289,33,289,35],[290,33,290,35],[291,33,291,35],[292,33,292,35],[293,33,293,35],[294,33,294,35],[295,33,295,35],[296,33,296,35],[297,33,297,35],[298,33,298,35],[299,33,299,35],[300,33,300,35],[301,33,301,35],[302,33,302,35],[303,33,303,35],[304,33,304,35],[305,33,305,35],[306,33,306,35],[307,33,307,35],[308,33,308,35],[309,33,309,35],[310,33,310,35],[311,33,311,35],[312,33,312,35],[313,33,313,35],[314,33,314,35],[315,33,315,35],[316,33,316,35],[317,33,317,35],[318,33,318,35],[319,33,319,35],[320,33,320,35],[321,33,321,35],[322,33,322,35],[323,33,323,35],[324,33,324,35],[325,33,325,35],[326,33,326,35],[327,33,327,35],[328,33,328,35],[329,33,329,35],[330,33,330,35],[331,33,331,35],[332,33,332,35],[333,33,333,35],[334,33,334,35],[335,33,335,35],[336,33,336,35],[337,33,337,35],[338,33,338,35],[339,33,339,35],[340,33,340,35],[341,33,341,35],[342,33,342,35],[343,33,343,35],[344,33,344,35],[345,33,345,35],[346,33,346,35],[347,33,347,35],[348,33,348,35],[349,33,349,35],[350,33,350,35],[351,33,351,35],[352,33,352,35],[353,33,353,35],[354,33,354,35],[355,33,355,35],[356,33,356,35],[357,33,357,35],[358,33,358,35],[359,33,359,35],[360,33,360,35],[361,33,361,35],[362,33,362,35],[363,33,363,35],[364,33,364,35],[365,33,365,35],[366,33,366,35],[367,33,367,35],[368,33,368,35],[369,33,369,35],[370,33,370,35],[371,33,371,35],[372,33,372,35],[373,33,373,35],[374,33,374,35],[375,33,375,35],[376,33,376,35],[377,33,377,35],[378,33,378,35],[379,33,379,35],[380,33,380,35],[381,33,381,35],[382,33,382,35],[383,33,383,35],[384,33,384,35],[385,33,385,35],[386,33,386,35],[387,33,387,35],[388,33,388,35],[389,33,389,35],[390,33,390,35],[391,33,391,35],[392,33,392,35],[393,33,393,35],[394,33,394,35],[395,33,395,35],[396,33,396,35],[397,33,397,35],[398,33,398,35],[399,33,399,35],[400,33,400,35],[401,33,401,35],[402,33,402,35],[403,33,403,35],[404,33,404,35],[405,33,405,35],[406,33,406,35],[407,33,407,35],[408,33,408,35],[409,33,409,35],[410,33,410,35],[411,33,411,35],[412,33,412,35],[413,33,413,35],[414,33,414,35],[415,33,415,35],[416,33,416,35],[417,33,417,35],[418,33,418,35],[419,33,419,35],[420,33,420,35],[421,33,421,35],[422,33,422,35],[423,33,423,35],[424,33,424,35],[425,33,425,35],[426,33,426,35],[427,33,427,35],[428,33,428,35],[429,33,429,35],[430,33,430,35],[431,33,431,35],[432,33,432,35],[433,33,433,35],[434,33,434,35],[435,33,435,35],[436,33,436,35],[437,33,437,35],[438,33,438,35],[439,33,439,35],[440,33,440,35],[441,33,441,35],[442,33,442,35],[443,33,443,35],[444,33,444,35],[445,33,445,35],[446,33,446,35],[447,33,447,35],[448,33,448,35],[449,33,449,35],[450,33,450,35],[451,33,451,35],[452,33,452,35],[453,33,453,35],[454,33,454,35],[455,33,455,35],[456,33,456,35],[457,33,457,35],[458,33,458,35],[459,33,459,35],[460,33,460,35],[461,33,461,35],[462,33,462,35],[463,33,463,35],[464,33,464,35],[465,33,465,35],[466,33,466,35],[467,33,467,35],[468,33,468,35],[469,33,469,35],[470,33,470,35],[471,33,471,35],[472,33,472,35],[473,33,473,35],[474,33,474,35],[475,33,475,35],[476,33,476,35],[477,33,477,35],[478,33,478,35],[479,33,479,35],[480,33,480,35],[481,33,481,35],[482,33,482,35],[483,33,483,35],[484,33,484,35],[485,33,485,35],[486,33,486,35],[487,33,487,35],[488,33,488,35],[489,33,489,35],[490,33,490,35],[491,33,491,35],[492,33,492,35],[493,33,493,35],[494,33,494,35],[495,33,495,35],[496,33,496,35],[497,33,497,35],[498,33,498,35],[499,33,499,35],[500,33,500,35],[501,33,501,35],[502,33,502,35],[503,33,503,35],[504,33,504,35],[505,33,505,35],[506,33,506,35],[507,33,507,35],[508,33,508,35],[509,33,509,35],[510,33,510,35],[511,33,511,35],[512,33,512,35],[513,33,513,35],[514,33,514,35],[515,33,515,35],[516,33,516,35],[517,33,517,35],[518,33,518,35],[519,33,519,35],[520,33,520,35],[521,33,521,35],[522,33,522,35],[523,33,523,35],[524,33,524,35],[525,33,525,35],[526,33,526,35],[527,33,527,35],[528,33,528,35],[529,33,529,35],[530,33,530,35],[531,33,531,35],[532,33,532,35],[533,33,533,35],[534,33,534,35],[535,33,535,35],[536,33,536,35],[537,33,537,35],[538,33,538,35],[539,33,539,35],[540,33,540,35],[541,33,541,35],[542,33,542,35],[543,33,543,35],[544,33,544,35],[545,33,545,35],[546,33,546,35],[547,33,547,35],[548,33,548,35],[549,33,549,35],[550,33,550,35],[551,33,551,35],[552,33,552,35],[553,33,553,35],[554,33,554,35],[555,33,555,35],[556,33,556,35],[557,33,557,35],[558,33,558,35],[559,33,559,35],[560,33,560,35],[561,33,561,35],[562,33,562,35],[563,33,563,35],[564,33,564,35],[565,33,565,35],[566,33,566,35],[567,33,567,35],[568,33,568,35],[569,33,569,35],[570,33,570,35],[571,33,571,35],[572,33,572,35],[573,33,573,35],[574,33,574,35],[575,33,575,35],[576,33,576,35],[577,33,577,35],[578,33,578,35],[579,33,579,35],[580,33,580,35],[581,33,581,35],[582,33,582,35],[583,33,583,35],[584,33,584,35],[585,33,585,35],[586,33,586,35],[587,33,587,35],[588,33,588,35],[589,33,589,35],[590,33,590,35],[591,33,591,35],[592,33,592,35],[593,33,593,35],[594,33,594,35],[595,33,595,35],[596,33,596,35],[597,33,597,35],[598,33,598,35],[599,33,599,35],[600,33,600,35],[601,33,601,35],[602,33,602,35],[603,33,603,35],[604,33,604,35],[605,33,605,35],[606,33,606,35],[607,33,607,35],[608,33,608,35],[609,33,609,35],[610,33,610,35],[611,33,611,35],[612,33,612,35],[613,33,613,35],[614,33,614,35],[615,33,615,35],[616,33,616,35],[617,33,617,35],[618,33,618,35],[619,33,619,35],[620,33,620,35],[621,33,621,35],[622,33,622,35],[623,33,623,35],[624,33,624,35],[625,33,625,35],[626,33,626,35],[627,33,627,35],[628,33,628,35],[629,33,629,35],[630,33,630,35],[631,33,631,35],[632,33,632,35],[633,33,633,35],[634,33,634,35],[635,33,635,35],[636,33,636,35],[637,33,637,35],[638,33,638,35],[639,33,639,35],[640,33,640,35],[641,33,641,35],[642,33,642,35],[643,33,643,35],[644,33,644,35],[645,33,645,35],[646,33,646,35],[647,33,647,35],[648,33,648,35],[649,33,649,35],[650,33,650,35],[651,33,651,35],[652,33,652,35],[653,33,653,35],[654,33,654,35],[655,33,655,35],[656,33,656,35],[657,33,657,35],[658,33,658,35],[659,33,659,35],[660,33,660,35],[661,33,661,35],[662,33,662,35],[663,33,663,35],[664,33,664,35],[665,33,665,35],[666,33,666,35],[667,33,667,35],[668,33,668,35],[669,33,669,35],[670,33,670,35],[671,33,671,35],[672,33,672,35],[673,33,673,35],[674,33,674,35],[675,33,675,35],[676,33,676,35],[677,33,677,35],[678,33,678,35],[679,33,679,35],[680,33,680,35],[681,33,681,35],[682,33,682,35],[683,33,683,35],[684,33,684,35],[685,33,685,35],[686,33,686,35],[687,33,687,35],[688,33,688,35],[689,33,689,35],[690,33,690,35],[691,33,691,35],[692,33,692,35],[693,33,693,35],[694,33,694,35],[695,33,695,35],[696,33,696,35],[697,33,697,35],[698,33,698,35],[699,33,699,35],[700,33,700,35],[701,33,701,35],[702,33,702,35],[703,33,703,35],[704,33,704,35],[705,33,705,35],[706,33,706,35],[707,33,707,35],[708,33,708,35],[709,33,709,35],[710,33,710,35],[711,33,711,35],[712,33,712,35],[713,33,713,35],[714,33,714,35],[715,33,715,35],[716,33,716,35],[717,33,717,35],[718,33,718,35],[719,33,719,35],[720,33,720,35],[721,33,721,35],[722,33,722,35],[723,33,723,35],[724,33,724,35],[725,33,725,35],[726,33,726,35],[727,33,727,35],[728,33,728,35],[729,33,729,35],[730,33,730,35],[731,33,731,35],[732,33,732,35],[733,33,733,35],[734,33,734,35],[735,33,735,35],[736,33,736,35],[737,33,737,35],[738,33,738,35],[739,33,739,35],[740,33,740,35],[741,33,741,35],[742,33,742,35],[743,33,743,35],[744,33,744,35],[745,33,745,35],[746,33,746,35],[747,33,747,35],[748,33,748,35],[749,33,749,35],[750,33,750,35],[751,33,751,35],[752,33,752,35],[753,33,753,35],[754,33,754,35],[755,33,755,35],[756,33,756,35],[757,33,757,35],[758,33,758,35],[759,33,759,35],[760,33,760,35],[761,33,761,35],[762,33,762,35],[763,33,763,35],[764,33,764,35],[765,33,765,35],[766,33,766,35],[767,33,767,35],[768,33,768,35],[769,33,769,35],[770,33,770,35],[771,33,771,35],[772,33,772,35],[773,33,773,35],[774,33,774,35],[775,33,775,35],[776,33,776,35],[777,33,777,35],[778,33,778,35],[779,33,779,35],[780,33,780,35],[781,33,781,35],[782,33,782,35],[783,33,783,35],[784,33,784,35],[785,33,785,35],[786,33,786,35],[787,33,787,35],[788,33,788,35],[789,33,789,35],[790,33,790,35],[791,33,791,35],[792,33,792,35],[793,33,793,35],[794,33,794,35],[795,33,795,35],[796,33,796,35],[797,33,797,35],[798,33,798,35],[799,33,799,35],[800,33,800,35],[801,33,801,35],[802,33,802,35],[803,33,803,35],[804,33,804,35],[805,33,805,35],[806,33,806,35],[807,33,807,35],[808,33,808,35],[809,33,809,35],[810,33,810,35],[811,33,811,35],[812,33,812,35],[813,33,813,35],[814,33,814,35],[815,33,815,35],[816,33,816,35],[817,33,817,35],[818,33,818,35],[819,33,819,35],[820,33,820,35],[821,33,821,35],[822,33,822,35],[823,33,823,35],[824,33,824,35],[825,33,825,35],[826,33,826,35],[827,33,827,35],[828,33,828,35],[829,33,829,35],[830,33,830,35],[831,33,831,35],[832,33,832,35],[833,33,833,35],[834,33,834,35],[835,33,835,35],[836,33,836,35],[837,33,837,35],[838,33,838,35],[839,33,839,35],[840,33,840,35],[841,33,841,35],[842,33,842,35],[843,33,843,35],[844,33,844,35],[845,33,845,35],[846,33,846,35],[847,33,847,35],[848,33,848,35],[849,33,849,35],[850,33,850,35],[851,33,851,35],[852,33,852,35],[853,33,853,35],[854,33,854,35],[855,33,855,35],[856,33,856,35],[857,33,857,35],[858,33,858,35],[859,33,859,35],[860,33,860,35],[861,33,861,35],[862,33,862,35],[863,33,863,35],[864,33,864,35],[865,33,865,35],[866,33,866,35],[867,33,867,35],[868,33,868,35],[869,33,869,35],[870,33,870,35],[871,33,871,35],[872,33,872,35],[873,33,873,35],[874,33,874,35],[875,33,875,35],[876,33,876,35],[877,33,877,35],[878,33,878,35],[879,33,879,35],[880,33,880,35],[881,33,881,35],[882,33,882,35],[883,33,883,35],[884,33,884,35],[885,33,885,35],[886,33,886,35],[887,33,887,35],[888,33,888,35],[889,33,889,35],[890,33,890,35],[891,33,891,35],[892,33,892,35],[893,33,893,35],[894,33,894,35],[895,33,895,35],[896,33,896,35],[897,33,897,35],[898,33,898,35],[899,33,899,35],[900,33,900,35],[901,33,901,35],[902,33,902,35],[903,33,903,35],[904,33,904,35],[905,33,905,35],[906,33,906,35],[907,33,907,35],[908,33,908,35],[909,33,909,35],[910,33,910,35],[911,33,911,35],[912,33,912,35],[913,33,913,35],[914,33,914,35],[915,33,915,35],[916,33,916,35],[917,33,917,35],[918,33,918,35],[919,33,919,35],[920,33,920,35],[921,33,921,35],[922,33,922,35],[923,33,923,35],[924,33,924,35],[925,33,925,35],[926,33,926,35],[927,33,927,35],[928,33,928,35],[929,33,929,35],[930,33,930,35],[931,33,931,35],[932,33,932,35],[933,33,933,35],[934,33,934,35],[935,33,935,35],[936,33,936,35],[944,33,944,35],[945,33,945,35],[946,33,946,35],[947,33,947,35],[948,33,948,35],[949,33,949,35],[950,33,950,35],[951,33,951,35],[952,33,952,35],[995,33,995,35],[996,33,996,35],[997,33,997,35],[998,33,998,35],[999,33,999,35],[1000,33,1000,35],[1001,33,1001,35],[1002,33,1002,35],[1003,33,1003,35],[1004,33,1004,35],[1005,33,1005,35],[1006,33,1006,35],[1007,33,1007,35],[1008,33,1008,35],[1009,33,1009,35],[1010,33,1010,35],[1011,33,1011,35],[1012,33,1012,35],[1013,33,1013,35],[1014,33,1014,35],[1015,33,1015,35],[1016,33,1016,35],[1017,33,1017,35],[1018,33,1018,35],[1024,10,1024,25],[1025,3,1025,4],[1025,13,1025,14],[1025,15,1025,16],[1025,18,1025,20],[1025,22,1025,25],[1026,3,1026,4],[1026,13,1026,14],[1026,15,1026,16],[1026,18,1026,20],[1026,22,1026,25],[1027,3,1027,4],[1027,13,1027,14],[1027,15,1027,16],[1027,18,1027,20],[1027,22,1027,25],[1028,3,1028,4],[1028,13,1028,14],[1028,15,1028,16],[1028,18,1028,20],[1028,22,1028,25],[1029,18,1029,20],[1030,18,1030,20],[1033,2,1033,16],[1034,2,1034,16],[1035,2,1035,16],[1036,2,1036,16],[1037,2,1037,16],[1038,2,1038,16],[1038,22,1039,22],[1038,23,1039,23],[1038,24,1039,24],[1038,25,1039,25],[1039,2,1039,16],[1040,2,1040,16],[1041,2,1041,16],[1042,2,1042,16],[1043,2,1043,16],[1044,2,1044,16],[1045,2,1045,16],[1046,2,1046,16]],"merged_total":1049,"flags":["merged_cut"]}
[{"$nulls":10},"2023 Incentive Rates","Last Updated: ",{"$f":"MAX('Version History'!$B$5:$B$40)","v":"2023-03-09"},{"$nulls":23},"Hide"]
[null,"Comprehensive Lighting Solutions"]
[]
[null,null,"Project Information"]
[{"$nulls":3},"Customer Name:",{"$nulls":3},"User Input"]
[{"$nulls":3},"Facility Name:",{"$nulls":3},"Calc Output"]
[{"$nulls":3},"Sector for Annual Run Hours:"]
[{"$nulls":3},"Annual Run Hours:","Default Sector Hours",{"$f":"IF(E8=\"Default Sector Hours\",IF(COUNTIF($AK$20:$AK$1019,\"Yes\")>0,\"To enter site specific hours of operation, change 'Annual Run Hours' from 'Default Sector Hours' to 'Manual Input'\",\"\"),\"\")","v":""}]
[{"$nulls":3},"Building Type for Coincidence Factor:","_Sector Default_","Coincidence Factor = ",{"$f":"VLOOKUP(E9,$AD$1036:$AE$1072,2,FALSE)","v":{"$error":"#N/A"}}]
[{"$nulls":3},"Sector for Utility Rates:","Commercial/Schools & Government"]
[{"$nulls":3},"Interior or 24/7 (On-Peak) Utility Rate:",{"$f":"VLOOKUP(E10,W1045:Z1047,2,FALSE)","v":{"v":0.1109,"d":"$0.1109"}},"Actual, if known.",{"$nulls":15},"hide",null,"hide"]
[{"$nulls":3},"Exterior (Off-Peak) Utility Rate:",{"v":0.077,"d":"$0.077"},"Actual, if known."]
[{"$nulls":3},"Estimated Project Size:","Small (10 rows)","Adjusts number of line items currently being shown."]
[{"$nulls":3},"% of Project Cost Cap:",{"v":0.5,"d":"50%"}]
[{"$nulls":3},"Baseline Adjustment to Account for Existing Controls:",{"v":0.1,"d":"10%"},"Interior",{"v":0,"d":"0%"},"Exterior"]
[]
[]
[null,"EXISTING LIGHTING",{"$nulls":8},"PROPOSED LIGHTING",{"$nulls":6},"ADDITIONAL INPUTS",null,null,"LIGHTING ENERGY USE",{"$nulls":5},"TOTAL ENERGY SAVINGS AND INCENTIVE",{"$nulls":4},"COSTS",null,"Notes & Supporting Docs"]
[null,"Line #","Location","Existing Lighting Category","Existing Lighting Fixture/Lamp","Description / Notes","Existing QTY","Default Input Watts","Manual Input Watts","Existing Annual Hours","Proposed Lighting Category","Proposed Lighting Fixture/Lamp","Description / Notes","Proposed QTY","Default Input Watts","Manual Input Watts","Proposed Annual Hours","Interior or Exterior?","On NLC Controls?","Qualifies for Prescriptive","Existing Peak kW",null,"Existing kWh",null,"Proposed Peak kW","Proposed kWh","Watts Reduced","Peak kW Savings","Annual kWh Savings","Qualifies for Code","Prescriptive     Incentive Code","Unit Cost","Total Cost",{"$nulls":3},"Existing Hours Overridden"]
[null,1,{"$nulls":5},{"$f":"IF(E20=\"\",\"\",VLOOKUP(E20,$AQ$1114:$AR$1541,2,FALSE))","v":""},null,{"$f":"IF(AND(E20<>\"\",G20<>\"\",$E$8=\"Default Sector Hours\"),VLOOKUP(IF(R20=\"Exterior\",\"Exterior\",$E$7),$W$1036:$X$1041,2,FALSE),\"\")","v":""},{"$nulls":4},{"$f":"IF(L20=\"\",\"\",VLOOKUP(L20,$AQ$1113:$AR$1541,2,FALSE))","v":""},null,{"$f":"IF(J20=\"\",\"\",J20)","v":""},null,"No",null,{"$f":"IF(V20=\"Int Control\",IF(E20=\"\",\"\",IF(OR(I20>0,H20=\"Enter Watts\"),I20*G20/1000*(1-$E$15),H20*G20/1000*(1-$E$15))),IF(E20=\"\",\"\",IF(OR(I20>0,H20=\"Enter Watts\"),I20*G20/1000,H20*G20/1000)))","v":""},{"$f":"IF(AND(R20=\"Interior\",S20=\"Yes\"),\"Int Control\",0)","v":{"v":0,"d":"0.0000"}},{"$f":"IFERROR(IF(V20=\"Int Control\",IF(E20=\"\",\"\",G20/1000*(1-$E$15)*IF(OR(I20>0,H20=\"Enter Watts\"),I20,H20)*IF(R20=\"Exterior\",$X$1041*(1-$G$15),IF($E$8=\"Manual Input\",J20,VLOOKUP($E$7,$W$1036:$Z$1040,2,FALSE)*(1-$E$15)))),IF(E20=\"\",\"\",G20/1000*IF(OR(I20>0,H20=\"Enter Watts\"),I20,H20)*IF(R20=\"Exterior\",$X$1041,IF($E$8=\"Manual Input\",J20,VLOOKUP($E$7,$W$1036:$Z$1040,2,FALSE))))),\"0\")","v":""},{"$f":"IF(S20=\"No\",0,AA$1036)","v":{"v":0,"d":"0.00"}},{"$f":"IF(R20=\"Interior\",IF(AND(L20=\"\",E20=\"\"),\"\",IF(OR(P20>0,O20=\"Enter Watts\",P20=\"\"),P20*N20*(1-X20)/1000,O20*N20(1-X20)/1000)),IF(AND(E20=\"\",L20=\"\"),\"\",0))","v":""},{"$f":"IFERROR(IF(AND(L20=\"\", E20=\"\"),\"\",N20/1000*IF(OR(P20>0,O20=\"Enter Watts\"),P20,O20)*IF(R20=\"Exterior\",$X$1041,IF($E$8=\"Manual Input\",Q20,VLOOKUP($E$7,$W$1036:$Z$1040,2,FALSE)))*IF(S20=\"Yes\",IF(R20=\"Exterior\",1-$Z$1041,1-VLOOKUP($E$7,$W$1036:$Z$1040,4,FALSE)),1)),0)","v":""},{"$f":"IFERROR(IF(OR(I20>0,H20=\"Enter Watts\"),I20*G20,H20*G20)-IF(OR(P20>0,O20=\"Enter Watts\"),P20*N20,O20*N20),\"\")","v":""},{"$f":"IF(AND(U20=\"\",Y20=\"\"),\"\",IF(OR(U20=\"\",Y20=\"\"),0,  IF($E$8=\"Manual Input\",$G$9,   VLOOKUP($E$7,$W$1036:$Z$1041,3,FALSE))     *(U20-Y20)))","v":""},{"$f":"IF(AND(W20=\"\",Z20=\"\"),\"\",IF(OR(W20=\"\",Z20=\"\"),0,W20-Z20))","v":""},{"$f":"IF(AC20=\"\",\"\",IF(AND(R20=\"Interior\",S20=\"No\",OR(T20=\"\",T20=\"No\")),$J$1027,IF(AND(R20=\"Interior\",S20=\"Yes\"),$J$1028,IF(AND(R20=\"Exterior\",S20=\"Yes\"),$J$1029,IF(AND(R20=\"Exterior\",S20=\"No\",N20<>G20),\"DNQ\",\"See Lighting Catalog to determine Code\")))))","v":""},null,null,{"$f":"AF20*N20","v":0},{"$nulls":3},{"$f":"IF(_xlfn.ISFORMULA(J20)=TRUE,\"No\",\"Yes\")","v":"No"},{"$nulls":6},"","",null,""]
[null,2,{"$nulls":5},"",null,"",{"$nulls":4},"",null,"",null,"No",null,{"$f":"IF(V21=\"Int Control\",IF(E21=\"\",\"\",IF(OR(I21>0,H21=\"Enter Watts\"),I21*G21/1000*(1-$E$15),H21*G21/1000*(1-$E$15))),IF(E21=\"\",\"\",IF(OR(I21>0,H21=\"Enter Watts\"),I21*G21/1000,H21*G21/1000)))","v":""},{"$f":"IF(AND(R21=\"Interior\",S21=\"Yes\"),\"Int Control\",0)","v":{"v":0,"d":"0.0000"}},{"$f":"IFERROR(IF(V21=\"Int Control\",IF(E21=\"\",\"\",G21/1000*(1-$E$15)*IF(OR(I21>0,H21=\"Enter Watts\"),I21,H21)*IF(R21=\"Exterior\",$X$1041*(1-$G$15),IF($E$8=\"Manual Input\",J21,VLOOKUP($E$7,$W$1036:$Z$1040,2,FALSE)*(1-$E$15)))),IF(E21=\"\",\"\",G21/1000*IF(OR(I21>0,H21=\"Enter Watts\"),I21,H21)*IF(R21=\"Exterior\",$X$1041,IF($E$8=\"Manual Input\",J21,VLOOKUP($E$7,$W$1036:$Z$1040,2,FALSE))))),\"0\")","v":""},{"$f":"IF(S21=\"No\",0,AA$1036)","v":{"v":0,"d":"0.00"}},{"$f":"IF(R21=\"Interior\",IF(AND(L21=\"\",E21=\"\"),\"\",IF(OR(P21>0,O21=\"Enter Watts\",P21=\"\"),P21*N21*(1-X21)/1000,O21*N21(1-X21)/1000)),IF(AND(E21=\"\",L21=\"\"),\"\",0))","v":""},"",{"$f":"IFERROR(IF(OR(I21>0,H21=\"Enter Watts\"),I21*G21,H21*G21)-IF(OR(P21>0,O21=\"Enter Watts\"),P21*N21,O21*N21),\"\")","v":""},"",{"$f":"IF(AND(W21=\"\",Z21=\"\"),\"\",IF(OR(W21=\"\",Z21=\"\"),0,W21-Z21))","v":""},"",null,null,{"$f":"AF21*N21","v":0},{"$nulls":3},{"$f":"IF(_xlfn.ISFORMULA(J21)=TRUE,\"No\",\"Yes\")","v":"No"}]
[null,3,{"$nulls":5},"",null,"",{"$nulls":4},"",null,"",null,"No",null,"",{"v":0,"d":"0.0000"},"",{"v":0,"d":"0.00"},{"$f":"IF(R22=\"Interior\",IF(AND(L22=\"\",E22=\"\"),\"\",IF(OR(P22>0,O22=\"Enter Watts\",P22=\"\"),P22*N22*(1-X22)/1000,O22*N22(1-X22)/1000)),IF(AND(E22=\"\",L22=\"\"),\"\",0))","v":""},"",{"$f":"IFERROR(IF(OR(I22>0,H22=\"Enter Watts\"),I22*G22,H22*G22)-IF(OR(P22>0,O22=\"Enter Watts\"),P22*N22,O22*N22),\"\")","v":""},"",{"$f":"IF(AND(W22=\"\",Z22=\"\"),\"\",IF(OR(W22=\"\",Z22=\"\"),0,W22-Z22))","v":""},"",null,null,0,{"$nulls":3},"No"]
[null,4,{"$nulls":5},"",null,{"$f":"IF(AND(E23<>\"\",G23<>\"\",$E$8=\"Default Sector Hours\"),VLOOKUP(IF(R23=\"Exterior\",\"Exterior\",$E$7),$W$1036:$X$1041,2,FALSE),\"\")","v":""},{"$nulls":4},"",null,{"$f":"IF(J23=\"\",\"\",J23)","v":""},null,"No",null,"",{"v":0,"d":"0.0000"},"",{"v":0,"d":"0.00"},{"$f":"IF(R23=\"Interior\",IF(AND(L23=\"\",E23=\"\"),\"\",IF(OR(P23>0,O23=\"Enter Watts\",P23=\"\"),P23*N23*(1-X23)/1000,O23*N23(1-X23)/1000)),IF(AND(E23=\"\",L23=\"\"),\"\",0))","v":""},"","","","","",null,null,0,{"$nulls":3},"No"]
[null,5,{"$nulls":5},"",null,"",{"$nulls":4},"",null,"",null,"No",null,"",{"v":0,"d":"0.0000"},"",{"v":0,"d":"0.00"},{"$f":"IF(R24=\"Interior\",IF(AND(L24=\"\",E24=\"\"),\"\",IF(OR(P24>0,O24=\"Enter Watts\",P24=\"\"),P24*N24*(1-X24)/1000,O24*N24(1-X24)/1000)),IF(AND(E24=\"\",L24=\"\"),\"\",0))","v":""},"","","","","",null,null,0,{"$nulls":3},"No"]
[null,6,{"$nulls":5},"",null,"",{"$nulls":4},"",null,"",null,"No",null,"",{"v":0,"d":"0.0000"},"",{"v":0,"d":"0.00"},{"$f":"IF(R25=\"Interior\",IF(AND(L25=\"\",E25=\"\"),\"\",IF(OR(P25>0,O25=\"Enter Watts\",P25=\"\"),P25*N25*(1-X25)/1000,O25*N25(1-X25)/1000)),IF(AND(E25=\"\",L25=\"\"),\"\",0))","v":""},"","","","","",null,null,0,{"$nulls":3},"No",{"$nulls":6},"","",null,""]
[null,7,{"$nulls":5},"",null,"",{"$nulls":4},"",null,"",null,"No",null,"",{"v":0,"d":"0.0000"},"",{"v":0,"d":"0.00"},{"$f":"IF(R26=\"Interior\",IF(AND(L26=\"\",E26=\"\"),\"\",IF(OR(P26>0,O26=\"Enter Watts\",P26=\"\"),P26*N26*(1-X26)/1000,O26*N26(1-X26)/1000)),IF(AND(E26=\"\",L26=\"\"),\"\",0))","v":""},"","","","","",null,null,0,{"$nulls":3},"No"]
[null,8,{"$nulls":5},"",null,"",{"$nulls":4},"",null,"",null,"No",null,"",{"v":0,"d":"0.0000"},"",{"v":0,"d":"0.00"},{"$f":"IF(R27=\"Interior\",IF(AND(L27=\"\",E27=\"\"),\"\",IF(OR(P27>0,O27=\"Enter Watts\",P27=\"\"),P27*N27*(1-X27)/1000,O27*N27(1-X27)/1000)),IF(AND(E27=\"\",L27=\"\"),\"\",0))","v":""},"","","","","",null,null,0,{"$nulls":3},"No"]
[null,9,{"$nulls":5},"",null,"",{"$nulls":4},"",null,"",null,"No",null,"",{"v":0,"d":"0.0000"},"",{"v":0,"d":"0.00"},{"$f":"IF(R28=\"Interior\",IF(AND(L28=\"\",E28=\"\"),\"\",IF(OR(P28>0,O28=\"Enter Watts\",P28=\"\"),P28*N28*(1-X28)/1000,O28*N28(1-X28)/1000)),IF(AND(E28=\"\",L28=\"\"),\"\",0))","v":""},"","","","","",null,null,0,{"$nulls":3},"No"]
[null,10,{"$nulls":5},"",null,"",{"$nulls":4},"",null,"",null,"No",null,"",{"v":0,"d":"0.0000"},"",{"v":0,"d":"0.00"},{"$f":"IF(R29=\"Interior\",IF(AND(L29=\"\",E29=\"\"),\"\",IF(OR(P29>0,O29=\"Enter Watts\",P29=\"\"),P29*N29*(1-X29)/1000,O29*N29(1-X29)/1000)),IF(AND(E29=\"\",L29=\"\"),\"\",0))","v":""},"",{"$f":"IFERROR(IF(OR(I29>0,H29=\"Enter Watts\"),I29*G29,H29*G29)-IF(OR(P29>0,O29=\"Enter Watts\"),P29*N29,O29*N29),\"\")","v":""},"","","",null,null,0,{"$nulls":3},"No"]
[null,11,{"$nulls":5},"",null,"",{"$nulls":4},"",null,"",null,"No",null,"",{"v":0,"d":"0.0000"},"",{"v":0,"d":"0.00"},{"$f":"IF(R30=\"Interior\",IF(AND(L30=\"\",E30=\"\"),\"\",IF(OR(P30>0,O30=\"Enter Watts\",P30=\"\"),P30*N30*(1-X30)/1000,O30*N30(1-X30)/1000)),IF(AND(E30=\"\",L30=\"\"),\"\",0))","v":""},"","","","","",null,null,0,{"$nulls":3},"No"]
[null,12,{"$nulls":5},"",null,"",{"$nulls":4},"",null,"",null,"No",null,"",{"v":0,"d":"0.0000"},"",{"v":0,"d":"0.00"},{"$f":"IF(R31=\"Interior\",IF(AND(L31=\"\",E31=\"\"),\"\",IF(OR(P31>0,O31=\"Enter Watts\",P31=\"\"),P31*N31*(1-X31)/1000,O31*N31(1-X31)/1000)),IF(AND(E31=\"\",L31=\"\"),\"\",0))","v":""},"","","","","",null,null,0,{"$nulls":3},"No",{"$nulls":6},"","",null,""]
[null,13,{"$nulls":5},"",null,"",{"$nulls":4},"",null,"",null,"No",null,"",{"v":0,"d":"0.0000"},"",{"v":0,"d":"0.00"},{"$f":"IF(R32=\"Interior\",IF(AND(L32=\"\",E32=\"\"),\"\",IF(OR(P32>0,O32=\"Enter Watts\",P32=\"\"),P32*N32*(1-X32)/1000,O32*N32(1-X32)/1000)),IF(AND(E32=\"\",L32=\"\"),\"\",0))","v":""},"","","","","",null,null,0,{"$nulls":3},"No"]
[null,14,{"$nulls":5},"",null,"",{"$nulls":4},"",null,"",null,"No",null,"",{"v":0,"d":"0.0000"},"",{"v":0,"d":"0.00"},{"$f":"IF(R33=\"Interior\",IF(AND(L33=\"\",E33=\"\"),\"\",IF(OR(P33>0,O33=\"Enter Watts\",P33=\"\"),P33*N33*(1-X33)/1000,O33*N33(1-X33)/1000)),IF(AND(E33=\"\",L33=\"\"),\"\",0))","v":""},"","","","","",null,null,0,{"$nulls":3},"No"]
[null,15,{"$nulls":5},"",null,"",{"$nulls":4},"",null,"",null,"No",null,"",{"v":0,"d":"0.0000"},"",{"v":0,"d":"0.00"},{"$f":"IF(R34=\"Interior\",IF(AND(L34=\"\",E34=\"\"),\"\",IF(OR(P34>0,O34=\"Enter Watts\",P34=\"\"),P34*N34*(1-X34)/1000,O34*N34(1-X34)/1000)),IF(AND(E34=\"\",L34=\"\"),\"\",0))","v":""},"","","","","",null,null,0,{"$nulls":3},"No"]
[null,16,{"$nulls":5},"",null,"",{"$nulls":4},"",null,"",null,"No",null,"",{"v":0,"d":"0.0000"},"",{"v":0,"d":"0.00"},{"$f":"IF(R35=\"Interior\",IF(AND(L35=\"\",E35=\"\"),\"\",IF(OR(P35>0,O35=\"Enter Watts\",P35=\"\"),P35*N35*(1-X35)/1000,O35*N35(1-X35)/1000)),IF(AND(E35=\"\",L35=\"\"),\"\",0))","v":""},"","","","","",null,null,0,{"$nulls":3},"No"]
[null,17,{"$nulls":5},"",null,"",{"$nulls":4},"",null,"",null,"No",null,"",{"v":0,"d":"0.0000"},"",{"v":0,"d":"0.00"},{"$f":"IF(R36=\"Interior\",IF(AND(L36=\"\",E36=\"\"),\"\",IF(OR(P36>0,O36=\"Enter Watts\",P36=\"\"),P36*N36*(1-X36)/1000,O36*N36(1-X36)/1000)),IF(AND(E36=\"\",L36=\"\"),\"\",0))","v":""},"","","","","",null,null,0,{"$nulls":3},"No"]
[null,18,{"$nulls":5},"",null,"",{"$nulls":4},"",null,"",null,"No",null,"",{"v":0,"d":"0.0000"},"",{"v":0,"d":"0.00"},{"$f":"IF(R37=\"Interior\",IF(AND(L37=\"\",E37=\"\"),\"\",IF(OR(P37>0,O37=\"Enter Watts\",P37=\"\"),P37*N37*(1-X37)/1000,O37*N37(1-X37)/1000)),IF(AND(E37=\"\",L37=\"\"),\"\",0))","v":""},"","","","","",null,null,0,{"$nulls":3},"No"]
[null,19,{"$nulls":5},"",null,"",{"$nulls":4},"",null,"",null,"No",null,"",{"v":0,"d":"0.0000"},"",{"v":0,"d":"0.00"},{"$f":"IF(R38=\"Interior\",IF(AND(L38=\"\",E38=\"\"),\"\",IF(OR(P38>0,O38=\"Enter Watts\",P38=\"\"),P38*N38*(1-X38)/1000,O38*N38(1-X38)/1000)),IF(AND(E38=\"\",L38=\"\"),\"\",0))","v":""},"","","","","",null,null,0,{"$nulls":3},"No",{"$nulls":6},"","",null,""]
[null,20,{"$nulls":5},"",null,"",{"$nulls":4},"",null,"",null,"No",null,"",{"v":0,"d":"0.0000"},"",{"v":0,"d":"0.00"},{"$f":"IF(R39=\"Interior\",IF(AND(L39=\"\",E39=\"\"),\"\",IF(OR(P39>0,O39=\"Enter Watts\",P39=\"\"),P39*N39*(1-X39)/1000,O39*N39(1-X39)/1000)),IF(AND(E39=\"\",L39=\"\"),\"\",0))","v":""},"","","","","",null,null,0,{"$nulls":3},"No"]
[null,21,{"$nulls":5},"",null,"",{"$nulls":4},"",null,"",null,"No",null,"",{"v":0,"d":"0.0000"},"",{"v":0,"d":"0.00"},{"$f":"IF(R40=\"Interior\",IF(AND(L40=\"\",E40=\"\"),\"\",IF(OR(P40>0,O40=\"Enter Watts\",P40=\"\"),P40*N40*(1-X40)/1000,O40*N40(1-X40)/1000)),IF(AND(E40=\"\",L40=\"\"),\"\",0))","v":""},"","","","","",null,null,0,{"$nulls":3},"No"]
[null,22,{"$nulls":5},"",null,"",{"$nulls":4},"",null,"",null,"No",null,"",{"v":0,"d":"0.0000"},"",{"v":0,"d":"0.00"},{"$f":"IF(R41=\"Interior\",IF(AND(L41=\"\",E41=\"\"),\"\",IF(OR(P41>0,O41=\"Enter Watts\",P41=\"\"),P41*N41*(1-X41)/1000,O41*N41(1-X41)/1000)),IF(AND(E41=\"\",L41=\"\"),\"\",0))","v":""},"","","","","",null,null,0,{"$nulls":3},"No"]
[null,23,{"$nulls":5},"",null,"",{"$nulls":4},"",null,"",null,"No",null,"",{"v":0,"d":"0.0000"},"",{"v":0,"d":"0.00"},{"$f":"IF(R42=\"Interior\",IF(AND(L42=\"\",E42=\"\"),\"\",IF(OR(P42>0,O42=\"Enter Watts\",P42=\"\"),P42*N42*(1-X42)/1000,O42*N42(1-X42)/1000)),IF(AND(E42=\"\",L42=\"\"),\"\",0))","v":""},"","","","","",null,null,0,{"$nulls":3},"No"]
[null,24,{"$nulls":5},"",null,"",{"$nulls":4},"",null,"",null,"No",null,"",{"v":0,"d":"0.0000"},"",{"v":0,"d":"0.00"},{"$f":"IF(R43=\"Interior\",IF(AND(L43=\"\",E43=\"\"),\"\",IF(OR(P43>0,O43=\"Enter Watts\",P43=\"\"),P43*N43*(1-X43)/1000,O43*N43(1-X43)/1000)),IF(AND(E43=\"\",L43=\"\"),\"\",0))","v":""},"","","","","",null,null,0,{"$nulls":3},"No"]
[null,25,{"$nulls":5},"",null,"",{"$nulls":4},"",null,"",null,"No",null,"",{"v":0,"d":"0.0000"},"",{"v":0,"d":"0.00"},{"$f":"IF(R44=\"Interior\",IF(AND(L44=\"\",E44=\"\"),\"\",IF(OR(P44>0,O44=\"Enter Watts\",P44=\"\"),P44*N44*(1-X44)/1000,O44*N44(1-X44)/1000)),IF(AND(E44=\"\",L44=\"\"),\"\",0))","v":""},"","","","","",null,null,0,{"$nulls":3},"No",{"$nulls":6},"","",null,""]
[null,26,{"$nulls":5},"",null,"",{"$nulls":4},"",null,"",null,"No",null,"",{"v":0,"d":"0.0000"},"",{"v":0,"d":"0.00"},{"$f":"IF(R45=\"Interior\",IF(AND(L45=\"\",E45=\"\"),\"\",IF(OR(P45>0,O45=\"Enter Watts\",P45=\"\"),P45*N45*(1-X45)/1000,O45*N45(1-X45)/1000)),IF(AND(E45=\"\",L45=\"\"),\"\",0))","v":""},"","","","","",null,null,0,{"$nulls":3},"No"]
[null,27,{"$nulls":5},"",null,"",{"$nulls":4},"",null,"",null,"No",null,"",{"v":0,"d":"0.0000"},"",{"v":0,"d":"0.00"},{"$f":"IF(R46=\"Interior\",IF(AND(L46=\"\",E46=\"\"),\"\",IF(OR(P46>0,O46=\"Enter Watts\",P46=\"\"),P46*N46*(1-X46)/1000,O46*N46(1-X46)/1000)),IF(AND(E46=\"\",L46=\"\"),\"\",0))","v":""},"","","","","",null,null,0,{"$nulls":3},"No"]
[null,28,{"$nulls":5},"",null,"",{"$nulls":4},"",null,"",null,"No",null,"",{"v":0,"d":"0.0000"},"",{"v":0,"d":"0.00"},{"$f":"IF(R47=\"Interior\",IF(AND(L47=\"\",E47=\"\"),\"\",IF(OR(P47>0,O47=\"Enter Watts\",P47=\"\"),P47*N47*(1-X47)/1000,O47*N47(1-X47)/1000)),IF(AND(E47=\"\",L47=\"\"),\"\",0))","v":""},"","","","","",null,null,0,{"$nulls":3},"No"]
[null,29,{"$nulls":5},"",null,"",{"$nulls":4},"",null,"",null,"No",null,"",{"v":0,"d":"0.0000"},"",{"v":0,"d":"0.00"},{"$f":"IF(R48=\"Interior\",IF(AND(L48=\"\",E48=\"\"),\"\",IF(OR(P48>0,O48=\"Enter Watts\",P48=\"\"),P48*N48*(1-X48)/1000,O48*N48(1-X48)/1000)),IF(AND(E48=\"\",L48=\"\"),\"\",0))","v":""},"","","","","",null,null,0,{"$nulls":3},"No"]
[null,30,{"$nulls":5},"",null,"",{"$nulls":4},"",null,"",null,"No",null,"",{"v":0,"d":"0.0000"},"",{"v":0,"d":"0.00"},{"$f":"IF(R49=\"Interior\",IF(AND(L49=\"\",E49=\"\"),\"\",IF(OR(P49>0,O49=\"Enter Watts\",P49=\"\"),P49*N49*(1-X49)/1000,O49*N49(1-X49)/1000)),IF(AND(E49=\"\",L49=\"\"),\"\",0))","v":""},"","","","","",null,null,0,{"$nulls":3},"No"]
[null,31,{"$nulls":5},"",null,"",{"$nulls":4},"",null,"",null,"No",null,"",{"v":0,"d":"0.0000"},"",{"v":0,"d":"0.00"},{"$f":"IF(R50=\"Interior\",IF(AND(L50=\"\",E50=\"\"),\"\",IF(OR(P50>0,O50=\"Enter Watts\",P50=\"\"),P50*N50*(1-X50)/1000,O50*N50(1-X50)/1000)),IF(AND(E50=\"\",L50=\"\"),\"\",0))","v":""},"","","","","",null,null,0,{"$nulls":3},"No"]
[null,32,{"$nulls":5},"",null,"",{"$nulls":4},"",null,"",null,"No",null,"",{"v":0,"d":"0.0000"},"",{"v":0,"d":"0.00"},{"$f":"IF(R51=\"Interior\",IF(AND(L51=\"\",E51=\"\"),\"\",IF(OR(P51>0,O51=\"Enter Watts\",P51=\"\"),P51*N51*(1-X51)/1000,O51*N51(1-X51)/1000)),IF(AND(E51=\"\",L51=\"\"),\"\",0))","v":""},"","","","","",null,null,0,{"$nulls":3},"No"]
[null,33,{"$nulls":5},"",null,"",{"$nulls":4},"",null,"",null,"No",null,"",{"v":0,"d":"0.0000"},"",{"v":0,"d":"0.00"},{"$f":"IF(R52=\"Interior\",IF(AND(L52=\"\",E52=\"\"),\"\",IF(OR(P52>0,O52=\"Enter Watts\",P52=\"\"),P52*N52*(1-X52)/1000,O52*N52(1-X52)/1000)),IF(AND(E52=\"\",L52=\"\"),\"\",0))","v":""},"","","","","",null,null,0,{"$nulls":3},"No"]
[null,34,{"$nulls":5},"",null,"",{"$nulls":4},"",null,"",null,"No",null,"",{"v":0,"d":"0.0000"},"",{"v":0,"d":"0.00"},{"$f":"IF(R53=\"Interior\",IF(AND(L53=\"\",E53=\"\"),\"\",IF(OR(P53>0,O53=\"Enter Watts\",P53=\"\"),P53*N53*(1-X53)/1000,O53*N53(1-X53)/1000)),IF(AND(E53=\"\",L53=\"\"),\"\",0))","v":""},"","","","","",null,null,0,{"$nulls":3},"No"]
[null,35,{"$nulls":5},"",null,"",{"$nulls":4},"",null,"",null,"No",null,"",{"v":0,"d":"0.0000"},"",{"v":0,"d":"0.00"},{"$f":"IF(R54=\"Interior\",IF(AND(L54=\"\",E54=\"\"),\"\",IF(OR(P54>0,O54=\"Enter Watts\",P54=\"\"),P54*N54*(1-X54)/1000,O54*N54(1-X54)/1000)),IF(AND(E54=\"\",L54=\"\"),\"\",0))","v":""},"","","","","",null,null,0,{"$nulls":3},"No"]
[null,36,{"$nulls":5},"",null,"",{"$nulls":4},"",null,"",null,"No",null,"",{"v":0,"d":"0.0000"},"",{"v":0,"d":"0.00"},{"$f":"IF(R55=\"Interior\",IF(AND(L55=\"\",E55=\"\"),\"\",IF(OR(P55>0,O55=\"Enter Watts\",P55=\"\"),P55*N55*(1-X55)/1000,O55*N55(1-X55)/1000)),IF(AND(E55=\"\",L55=\"\"),\"\",0))","v":""},"","","","","",null,null,0,{"$nulls":3},"No"]
[null,37,{"$nulls":5},"",null,"",{"$nulls":4},"",null,"",null,"No",null,"",{"v":0,"d":"0.0000"},"",{"v":0,"d":"0.00"},{"$f":"IF(R56=\"Interior\",IF(AND(L56=\"\",E56=\"\"),\"\",IF(OR(P56>0,O56=\"Enter Watts\",P56=\"\"),P56*N56*(1-X56)/1000,O56*N56(1-X56)/1000)),IF(AND(E56=\"\",L56=\"\"),\"\",0))","v":""},"","","","","",null,null,0,{"$nulls":3},"No",{"$nulls":6},"","",null,""]
[null,38,{"$nulls":5},"",null,"",{"$nulls":4},"",null,"",null,"No",null,"",{"v":0,"d":"0.0000"},"",{"v":0,"d":"0.00"},{"$f":"IF(R57=\"Interior\",IF(AND(L57=\"\",E57=\"\"),\"\",IF(OR(P57>0,O57=\"Enter Watts\",P57=\"\"),P57*N57*(1-X57)/1000,O57*N57(1-X57)/1000)),IF(AND(E57=\"\",L57=\"\"),\"\",0))","v":""},"","","","","",null,null,0,{"$nulls":3},"No"]
[null,39,{"$nulls":5},"",null,"",{"$nulls":4},"",null,"",null,"No",null,"",{"v":0,"d":"0.0000"},"",{"v":0,"d":"0.00"},{"$f":"IF(R58=\"Interior\",IF(AND(L58=\"\",E58=\"\"),\"\",IF(OR(P58>0,O58=\"Enter Watts\",P58=\"\"),P58*N58*(1-X58)/1000,O58*N58(1-X58)/1000)),IF(AND(E58=\"\",L58=\"\"),\"\",0))","v":""},"","","","","",null,null,0,{"$nulls":3},"No"]
[null,40,{"$nulls":5},"",null,"",{"$nulls":4},"",null,"",null,"No",null,"",{"v":0,"d":"0.0000"},"",{"v":0,"d":"0.00"},{"$f":"IF(R59=\"Interior\",IF(AND(L59=\"\",E59=\"\"),\"\",IF(OR(P59>0,O59=\"Enter Watts\",P59=\"\"),P59*N59*(1-X59)/1000,O59*N59(1-X59)/1000)),IF(AND(E59=\"\",L59=\"\"),\"\",0))","v":""},"","","","","",null,null,0,{"$nulls":3},"No"]
[null,41,{"$nulls":5},"",null,"",{"$nulls":4},"",null,"",null,"No",null,"",{"v":0,"d":"0.0000"},"",{"v":0,"d":"0.00"},{"$f":"IF(R60=\"Interior\",IF(AND(L60=\"\",E60=\"\"),\"\",IF(OR(P60>0,O60=\"Enter Watts\",P60=\"\"),P60*N60*(1-X60)/1000,O60*N60(1-X60)/1000)),IF(AND(E60=\"\",L60=\"\"),\"\",0))","v":""},"","","","","",null,null,0,{"$nulls":3},"No"]
[null,42,{"$nulls":5},"",null,"",{"$nulls":4},"",null,"",null,"No",null,"",{"v":0,"d":"0.0000"},"",{"v":0,"d":"0.00"},{"$f":"IF(R61=\"Interior\",IF(AND(L61=\"\",E61=\"\"),\"\",IF(OR(P61>0,O61=\"Enter Watts\",P61=\"\"),P61*N61*(1-X61)/1000,O61*N61(1-X61)/1000)),IF(AND(E61=\"\",L61=\"\"),\"\",0))","v":""},"","","","","",null,null,0,{"$nulls":3},"No"]
[null,43,{"$nulls":5},"",null,"",{"$nulls":4},"",null,"",null,"No",null,"",{"v":0,"d":"0.0000"},"",{"v":0,"d":"0.00"},{"$f":"IF(R62=\"Interior\",IF(AND(L62=\"\",E62=\"\"),\"\",IF(OR(P62>0,O62=\"Enter Watts\",P62=\"\"),P62*N62*(1-X62)/1000,O62*N62(1-X62)/1000)),IF(AND(E62=\"\",L62=\"\"),\"\",0))","v":""},"","","","","",null,null,0,{"$nulls":3},"No",{"$nulls":6},"","",null,""]
[null,44,{"$nulls":5},"",null,"",{"$nulls":4},"",null,"",null,"No",null,"",{"v":0,"d":"0.0000"},"",{"v":0,"d":"0.00"},{"$f":"IF(R63=\"Interior\",IF(AND(L63=\"\",E63=\"\"),\"\",IF(OR(P63>0,O63=\"Enter Watts\",P63=\"\"),P63*N63*(1-X63)/1000,O63*N63(1-X63)/1000)),IF(AND(E63=\"\",L63=\"\"),\"\",0))","v":""},"","","","","",null,null,0,{"$nulls":3},"No"]
[null,45,{"$nulls":5},"",null,"",{"$nulls":4},"",null,"",null,"No",null,"",{"v":0,"d":"0.0000"},"",{"v":0,"d":"0.00"},{"$f":"IF(R64=\"Interior\",IF(AND(L64=\"\",E64=\"\"),\"\",IF(OR(P64>0,O64=\"Enter Watts\",P64=\"\"),P64*N64*(1-X64)/1000,O64*N64(1-X64)/1000)),IF(AND(E64=\"\",L64=\"\"),\"\",0))","v":""},"","","","","",null,null,0,{"$nulls":3},"No"]
[null,46,{"$nulls":5},"",null,"",{"$nulls":4},"",null,"",null,"No",null,"",{"v":0,"d":"0.0000"},"",{"v":0,"d":"0.00"},{"$f":"IF(R65=\"Interior\",IF(AND(L65=\"\",E65=\"\"),\"\",IF(OR(P65>0,O65=\"Enter Watts\",P65=\"\"),P65*N65*(1-X65)/1000,O65*N65(1-X65)/1000)),IF(AND(E65=\"\",L65=\"\"),\"\",0))","v":""},"","","","","",null,null,0,{"$nulls":3},"No"]
[null,47,{"$nulls":5},"",null,"",{"$nulls":4},"",null,"",null,"No",null,"",{"v":0,"d":"0.0000"},"",{"v":0,"d":"0.00"},{"$f":"IF(R66=\"Interior\",IF(AND(L66=\"\",E66=\"\"),\"\",IF(OR(P66>0,O66=\"Enter Watts\",P66=\"\"),P66*N66*(1-X66)/1000,O66*N66(1-X66)/1000)),IF(AND(E66=\"\",L66=\"\"),\"\",0))","v":""},"","","","","",null,null,0,{"$nulls":3},"No"]
[null,48,{"$nulls":5},"",null,"",{"$nulls":4},"",null,"",null,"No",null,"",{"v":0,"d":"0.0000"},"",{"v":0,"d":"0.00"},{"$f":"IF(R67=\"Interior\",IF(AND(L67=\"\",E67=\"\"),\"\",IF(OR(P67>0,O67=\"Enter Watts\",P67=\"\"),P67*N67*(1-X67)/1000,O67*N67(1-X67)/1000)),IF(AND(E67=\"\",L67=\"\"),\"\",0))","v":""},"","","","","",null,null,0,{"$nulls":3},"No"]
[null,49,{"$nulls":5},"",null,"",{"$nulls":4},"",null,"",null,"No",null,"",{"v":0,"d":"0.0000"},"",{"v":0,"d":"0.00"},{"$f":"IF(R68=\"Interior\",IF(AND(L68=\"\",E68=\"\"),\"\",IF(OR(P68>0,O68=\"Enter Watts\",P68=\"\"),P68*N68*(1-X68)/1000,O68*N68(1-X68)/1000)),IF(AND(E68=\"\",L68=\"\"),\"\",0))","v":""},"","","","","",null,null,0,{"$nulls":3},"No"]
[null,50,{"$nulls":5},"",null,"",{"$nulls":4},"",null,"",null,"No",null,"",{"v":0,"d":"0.0000"},"",{"v":0,"d":"0.00"},{"$f":"IF(R69=\"Interior\",IF(AND(L69=\"\",E69=\"\"),\"\",IF(OR(P69>0,O69=\"Enter Watts\",P69=\"\"),P69*N69*(1-X69)/1000,O69*N69(1-X69)/1000)),IF(AND(E69=\"\",L69=\"\"),\"\",0))","v":""},"",{"$f":"IFERROR(IF(OR(I69>0,H69=\"Enter Watts\"),I69*G69,H69*G69)-IF(OR(P69>0,O69=\"Enter Watts\"),P69*N69,O69*N69),\"\")","v":""},"",{"$f":"IF(AND(W69=\"\",Z69=\"\"),\"\",IF(OR(W69=\"\",Z69=\"\"),0,W69-Z69))","v":""},"",null,null,0,{"$nulls":3},"No"]
[null,51,{"$nulls":5},"",null,"",{"$nulls":4},"",null,"",null,"No",null,"",{"v":0,"d":"0.0000"},"",{"v":0,"d":"0.00"},{"$f":"IF(R70=\"Interior\",IF(AND(L70=\"\",E70=\"\"),\"\",IF(OR(P70>0,O70=\"Enter Watts\",P70=\"\"),P70*N70*(1-X70)/1000,O70*N70(1-X70)/1000)),IF(AND(E70=\"\",L70=\"\"),\"\",0))","v":""},"",{"$f":"IFERROR(IF(OR(I70>0,H70=\"Enter Watts\"),I70*G70,H70*G70)-IF(OR(P70>0,O70=\"Enter Watts\"),P70*N70,O70*N70),\"\")","v":""},"",{"$f":"IF(AND(W70=\"\",Z70=\"\"),\"\",IF(OR(W70=\"\",Z70=\"\"),0,W70-Z70))","v":""},"",null,null,0,{"$nulls":3},"No"]
[null,52,{"$nulls":5},"",null,"",{"$nulls":4},"",null,"",null,"No",null,"",{"v":0,"d":"0.0000"},"",{"v":0,"d":"0.00"},{"$f":"IF(R71=\"Interior\",IF(AND(L71=\"\",E71=\"\"),\"\",IF(OR(P71>0,O71=\"Enter Watts\",P71=\"\"),P71*N71*(1-X71)/1000,O71*N71(1-X71)/1000)),IF(AND(E71=\"\",L71=\"\"),\"\",0))","v":""},"","","","","",null,null,0,{"$nulls":3},"No"]
[null,53,{"$nulls":5},"",null,"",{"$nulls":4},"",null,"",null,"No",null,"",{"v":0,"d":"0.0000"},"",{"v":0,"d":"0.00"},{"$f":"IF(R72=\"Interior\",IF(AND(L72=\"\",E72=\"\"),\"\",IF(OR(P72>0,O72=\"Enter Watts\",P72=\"\"),P72*N72*(1-X72)/1000,O72*N72(1-X72)/1000)),IF(AND(E72=\"\",L72=\"\"),\"\",0))","v":""},"","","","","",null,null,0,{"$nulls":3},"No"]
[null,54,{"$nulls":5},"",null,"",{"$nulls":4},"",null,"",null,"No",null,"",{"v":0,"d":"0.0000"},"",{"v":0,"d":"0.00"},{"$f":"IF(R73=\"Interior\",IF(AND(L73=\"\",E73=\"\"),\"\",IF(OR(P73>0,O73=\"Enter Watts\",P73=\"\"),P73*N73*(1-X73)/1000,O73*N73(1-X73)/1000)),IF(AND(E73=\"\",L73=\"\"),\"\",0))","v":""},"","","","","",null,null,0,{"$nulls":3},"No",{"$nulls":6},"","",null,""]
[null,55,{"$nulls":5},"",null,"",{"$nulls":4},"",null,"",null,"No",null,"",{"v":0,"d":"0.0000"},"",{"v":0,"d":"0.00"},{"$f":"IF(R74=\"Interior\",IF(AND(L74=\"\",E74=\"\"),\"\",IF(OR(P74>0,O74=\"Enter Watts\",P74=\"\"),P74*N74*(1-X74)/1000,O74*N74(1-X74)/1000)),IF(AND(E74=\"\",L74=\"\"),\"\",0))","v":""},"","","","","",null,null,0,{"$nulls":3},"No"]
[null,56,{"$nulls":5},"",null,"",{"$nulls":4},"",null,"",null,"No",null,"",{"v":0,"d":"0.0000"},"",{"v":0,"d":"0.00"},{"$f":"IF(R75=\"Interior\",IF(AND(L75=\"\",E75=\"\"),\"\",IF(OR(P75>0,O75=\"Enter Watts\",P75=\"\"),P75*N75*(1-X75)/1000,O75*N75(1-X75)/1000)),IF(AND(E75=\"\",L75=\"\"),\"\",0))","v":""},"","","","","",null,null,0,{"$nulls":3},"No"]
[null,57,{"$nulls":5},"",null,"",{"$nulls":4},"",null,"",null,"No",null,"",{"v":0,"d":"0.0000"},"",{"v":0,"d":"0.00"},{"$f":"IF(R76=\"Interior\",IF(AND(L76=\"\",E76=\"\"),\"\",IF(OR(P76>0,O76=\"Enter Watts\",P76=\"\"),P76*N76*(1-X76)/1000,O76*N76(1-X76)/1000)),IF(AND(E76=\"\",L76=\"\"),\"\",0))","v":""},"","","","","",null,null,0,{"$nulls":3},"No"]
[null,58,{"$nulls":5},"",null,"",{"$nulls":4},"",null,"",null,"No",null,"",{"v":0,"d":"0.0000"},"",{"v":0,"d":"0.00"},{"$f":"IF(R77=\"Interior\",IF(AND(L77=\"\",E77=\"\"),\"\",IF(OR(P77>0,O77=\"Enter Watts\",P77=\"\"),P77*N77*(1-X77)/1000,O77*N77(1-X77)/1000)),IF(AND(E77=\"\",L77=\"\"),\"\",0))","v":""},"","","","","",null,null,0,{"$nulls":3},"No"]
[null,59,{"$nulls":5},"",null,"",{"$nulls":4},"",null,"",null,"No",null,"",{"v":0,"d":"0.0000"},"",{"v":0,"d":"0.00"},{"$f":"IF(R78=\"Interior\",IF(AND(L78=\"\",E78=\"\"),\"\",IF(OR(P78>0,O78=\"Enter Watts\",P78=\"\"),P78*N78*(1-X78)/1000,O78*N78(1-X78)/1000)),IF(AND(E78=\"\",L78=\"\"),\"\",0))","v":""},"","","","","",null,null,0,{"$nulls":3},"No"]
[null,60,{"$nulls":5},"",null,"",{"$nulls":4},"",null,"",null,"No",null,"",{"v":0,"d":"0.0000"},"",{"v":0,"d":"0.00"},{"$f":"IF(R79=\"Interior\",IF(AND(L79=\"\",E79=\"\"),\"\",IF(OR(P79>0,O79=\"Enter Watts\",P79=\"\"),P79*N79*(1-X79)/1000,O79*N79(1-X79)/1000)),IF(AND(E79=\"\",L79=\"\"),\"\",0))","v":""},"","","","","",null,null,0,{"$nulls":3},"No",{"$nulls":6},"","",null,""]
[null,61,{"$nulls":5},"",null,"",{"$nulls":4},"",null,"",null,"No",null,"",{"v":0,"d":"0.0000"},"",{"v":0,"d":"0.00"},{"$f":"IF(R80=\"Interior\",IF(AND(L80=\"\",E80=\"\"),\"\",IF(OR(P80>0,O80=\"Enter Watts\",P80=\"\"),P80*N80*(1-X80)/1000,O80*N80(1-X80)/1000)),IF(AND(E80=\"\",L80=\"\"),\"\",0))","v":""},"","","","","",null,null,0,{"$nulls":3},"No"]
[null,62,{"$nulls":5},"",null,"",{"$nulls":4},"",null,"",null,"No",null,"",{"v":0,"d":"0.0000"},"",{"v":0,"d":"0.00"},{"$f":"IF(R81=\"Interior\",IF(AND(L81=\"\",E81=\"\"),\"\",IF(OR(P81>0,O81=\"Enter Watts\",P81=\"\"),P81*N81*(1-X81)/1000,O81*N81(1-X81)/1000)),IF(AND(E81=\"\",L81=\"\"),\"\",0))","v":""},"","","","","",null,null,0,{"$nulls":3},"No"]
[null,63,{"$nulls":5},"",null,"",{"$nulls":4},"",null,"",null,"No",null,"",{"v":0,"d":"0.0000"},"",{"v":0,"d":"0.00"},{"$f":"IF(R82=\"Interior\",IF(AND(L82=\"\",E82=\"\"),\"\",IF(OR(P82>0,O82=\"Enter Watts\",P82=\"\"),P82*N82*(1-X82)/1000,O82*N82(1-X82)/1000)),IF(AND(E82=\"\",L82=\"\"),\"\",0))","v":""},"","","","","",null,null,0,{"$nulls":3},"No"]
[null,64,{"$nulls":5},"",null,"",{"$nulls":4},"",null,"",null,"No",null,"",{"v":0,"d":"0.0000"},"",{"v":0,"d":"0.00"},{"$f":"IF(R83=\"Interior\",IF(AND(L83=\"\",E83=\"\"),\"\",IF(OR(P83>0,O83=\"Enter Watts\",P83=\"\"),P83*N83*(1-X83)/1000,O83*N83(1-X83)/1000)),IF(AND(E83=\"\",L83=\"\"),\"\",0))","v":""},"","","","","",null,null,0,{"$nulls":3},"No"]
[null,65,{"$nulls":5},{"$f":"IF(E84=\"\",\"\",VLOOKUP(E84,$AQ$1114:$AR$1541,2,FALSE))","v":""},null,{"$f":"IF(AND(E84<>\"\",G84<>\"\",$E$8=\"Default Sector Hours\"),VLOOKUP(IF(R84=\"Exterior\",\"Exterior\",$E$7),$W$1036:$X$1041,2,FALSE),\"\")","v":""},{"$nulls":4},{"$f":"IF(L84=\"\",\"\",VLOOKUP(L84,$AQ$1113:$AR$1541,2,FALSE))","v":""},null,"",null,"No",null,"",{"v":0,"d":"0.0000"},"",{"v":0,"d":"0.00"},{"$f":"IF(R84=\"Interior\",IF(AND(L84=\"\",E84=\"\"),\"\",IF(OR(P84>0,O84=\"Enter Watts\",P84=\"\"),P84*N84*(1-X84)/1000,O84*N84(1-X84)/1000)),IF(AND(E84=\"\",L84=\"\"),\"\",0))","v":""},{"$f":"IFERROR(IF(AND(L84=\"\", E84=\"\"),\"\",N84/1000*IF(OR(P84>0,O84=\"Enter Watts\"),P84,O84)*IF(R84=\"Exterior\",$X$1041,IF($E$8=\"Manual Input\",Q84,VLOOKUP($E$7,$W$1036:$Z$1040,2,FALSE)))*IF(S84=\"Yes\",IF(R84=\"Exterior\",1-$Z$1041,1-VLOOKUP($E$7,$W$1036:$Z$1040,4,FALSE)),1)),0)","v":""},"",{"$f":"IF(AND(U84=\"\",Y84=\"\"),\"\",IF(OR(U84=\"\",Y84=\"\"),0,  IF($E$8=\"Manual Input\",$G$9,   VLOOKUP($E$7,$W$1036:$Z$1041,3,FALSE))     *(U84-Y84)))","v":""},"",{"$f":"IF(AC84=\"\",\"\",IF(AND(R84=\"Interior\",S84=\"No\",OR(T84=\"\",T84=\"No\")),$J$1027,IF(AND(R84=\"Interior\",S84=\"Yes\"),$J$1028,IF(AND(R84=\"Exterior\",S84=\"Yes\"),$J$1029,IF(AND(R84=\"Exterior\",S84=\"No\",N84<>G84),\"DNQ\",\"See Lighting Catalog to determine Code\")))))","v":""},null,null,0,{"$nulls":3},"No"]
[null,66,{"$nulls":5},"",null,"",{"$nulls":4},"",null,"",null,"No",null,{"$f":"IF(V85=\"Int Control\",IF(E85=\"\",\"\",IF(OR(I85>0,H85=\"Enter Watts\"),I85*G85/1000*(1-$E$15),H85*G85/1000*(1-$E$15))),IF(E85=\"\",\"\",IF(OR(I85>0,H85=\"Enter Watts\"),I85*G85/1000,H85*G85/1000)))","v":""},{"$f":"IF(AND(R85=\"Interior\",S85=\"Yes\"),\"Int Control\",0)","v":{"v":0,"d":"0.0000"}},{"$f":"IFERROR(IF(V85=\"Int Control\",IF(E85=\"\",\"\",G85/1000*(1-$E$15)*IF(OR(I85>0,H85=\"Enter Watts\"),I85,H85)*IF(R85=\"Exterior\",$X$1041*(1-$G$15),IF($E$8=\"Manual Input\",J85,VLOOKUP($E$7,$W$1036:$Z$1040,2,FALSE)*(1-$E$15)))),IF(E85=\"\",\"\",G85/1000*IF(OR(I85>0,H85=\"Enter Watts\"),I85,H85)*IF(R85=\"Exterior\",$X$1041,IF($E$8=\"Manual Input\",J85,VLOOKUP($E$7,$W$1036:$Z$1040,2,FALSE))))),\"0\")","v":""},{"$f":"IF(S85=\"No\",0,AA$1036)","v":{"v":0,"d":"0.00"}},{"$f":"IF(R85=\"Interior\",IF(AND(L85=\"\",E85=\"\"),\"\",IF(OR(P85>0,O85=\"Enter Watts\",P85=\"\"),P85*N85*(1-X85)/1000,O85*N85(1-X85)/1000)),IF(AND(E85=\"\",L85=\"\"),\"\",0))","v":""},"","","","","",null,null,{"$f":"AF85*N85","v":0},{"$nulls":3},{"$f":"IF(_xlfn.ISFORMULA(J85)=TRUE,\"No\",\"Yes\")","v":"No"}]
[null,67,{"$nulls":5},"",null,"",{"$nulls":4},"",null,"",null,"No",null,"",{"v":0,"d":"0.0000"},"",{"v":0,"d":"0.00"},{"$f":"IF(R86=\"Interior\",IF(AND(L86=\"\",E86=\"\"),\"\",IF(OR(P86>0,O86=\"Enter Watts\",P86=\"\"),P86*N86*(1-X86)/1000,O86*N86(1-X86)/1000)),IF(AND(E86=\"\",L86=\"\"),\"\",0))","v":""},"","","","","",null,null,0,{"$nulls":3},"No",{"$nulls":6},"","",null,""]
[null,68,{"$nulls":5},"",null,"",{"$nulls":4},"",null,"",null,"No",null,"",{"v":0,"d":"0.0000"},"",{"v":0,"d":"0.00"},{"$f":"IF(R87=\"Interior\",IF(AND(L87=\"\",E87=\"\"),\"\",IF(OR(P87>0,O87=\"Enter Watts\",P87=\"\"),P87*N87*(1-X87)/1000,O87*N87(1-X87)/1000)),IF(AND(E87=\"\",L87=\"\"),\"\",0))","v":""},"","","","","",null,null,0,{"$nulls":3},"No"]
[null,69,{"$nulls":5},"",null,"",{"$nulls":4},"",null,"",null,"No",null,"",{"v":0,"d":"0.0000"},"",{"v":0,"d":"0.00"},{"$f":"IF(R88=\"Interior\",IF(AND(L88=\"\",E88=\"\"),\"\",IF(OR(P88>0,O88=\"Enter Watts\",P88=\"\"),P88*N88*(1-X88)/1000,O88*N88(1-X88)/1000)),IF(AND(E88=\"\",L88=\"\"),\"\",0))","v":""},"","","","","",null,null,0,{"$nulls":3},"No"]
[null,70,{"$nulls":5},"",null,"",{"$nulls":4},"",null,"",null,"No",null,"",{"v":0,"d":"0.0000"},"",{"v":0,"d":"0.00"},{"$f":"IF(R89=\"Interior\",IF(AND(L89=\"\",E89=\"\"),\"\",IF(OR(P89>0,O89=\"Enter Watts\",P89=\"\"),P89*N89*(1-X89)/1000,O89*N89(1-X89)/1000)),IF(AND(E89=\"\",L89=\"\"),\"\",0))","v":""},"","","","","",null,null,0,{"$nulls":3},"No"]
[null,71,{"$nulls":5},"",null,"",{"$nulls":4},"",null,"",null,"No",null,"",{"v":0,"d":"0.0000"},"",{"v":0,"d":"0.00"},{"$f":"IF(R90=\"Interior\",IF(AND(L90=\"\",E90=\"\"),\"\",IF(OR(P90>0,O90=\"Enter Watts\",P90=\"\"),P90*N90*(1-X90)/1000,O90*N90(1-X90)/1000)),IF(AND(E90=\"\",L90=\"\"),\"\",0))","v":""},"","","","","",null,null,0,{"$nulls":3},"No"]
[null,72,{"$nulls":5},"",null,"",{"$nulls":4},"",null,"",null,"No",null,"",{"v":0,"d":"0.0000"},"",{"v":0,"d":"0.00"},{"$f":"IF(R91=\"Interior\",IF(AND(L91=\"\",E91=\"\"),\"\",IF(OR(P91>0,O91=\"Enter Watts\",P91=\"\"),P91*N91*(1-X91)/1000,O91*N91(1-X91)/1000)),IF(AND(E91=\"\",L91=\"\"),\"\",0))","v":""},"","","","","",null,null,0,{"$nulls":3},"No"]
[null,73,{"$nulls":5},"",null,"",{"$nulls":4},"",null,"",null,"No",null,"",{"v":0,"d":"0.0000"},"",{"v":0,"d":"0.00"},{"$f":"IF(R92=\"Interior\",IF(AND(L92=\"\",E92=\"\"),\"\",IF(OR(P92>0,O92=\"Enter Watts\",P92=\"\"),P92*N92*(1-X92)/1000,O92*N92(1-X92)/1000)),IF(AND(E92=\"\",L92=\"\"),\"\",0))","v":""},"","","","","",null,null,0,{"$nulls":3},"No",{"$nulls":6},"","",null,""]
[null,74,{"$nulls":5},"",null,"",{"$nulls":4},"",null,"",null,"No",null,"",{"v":0,"d":"0.0000"},"",{"v":0,"d":"0.00"},{"$f":"IF(R93=\"Interior\",IF(AND(L93=\"\",E93=\"\"),\"\",IF(OR(P93>0,O93=\"Enter Watts\",P93=\"\"),P93*N93*(1-X93)/1000,O93*N93(1-X93)/1000)),IF(AND(E93=\"\",L93=\"\"),\"\",0))","v":""},"","","","","",null,null,0,{"$nulls":3},"No"]
[null,75,{"$nulls":5},"",null,"",{"$nulls":4},"",null,"",null,"No",null,"",{"v":0,"d":"0.0000"},"",{"v":0,"d":"0.00"},{"$f":"IF(R94=\"Interior\",IF(AND(L94=\"\",E94=\"\"),\"\",IF(OR(P94>0,O94=\"Enter Watts\",P94=\"\"),P94*N94*(1-X94)/1000,O94*N94(1-X94)/1000)),IF(AND(E94=\"\",L94=\"\"),\"\",0))","v":""},"","","","","",null,null,0,{"$nulls":3},"No"]
[null,76,{"$nulls":5},"",null,"",{"$nulls":4},"",null,"",null,"No",null,"",{"v":0,"d":"0.0000"},"",{"v":0,"d":"0.00"},{"$f":"IF(R95=\"Interior\",IF(AND(L95=\"\",E95=\"\"),\"\",IF(OR(P95>0,O95=\"Enter Watts\",P95=\"\"),P95*N95*(1-X95)/1000,O95*N95(1-X95)/1000)),IF(AND(E95=\"\",L95=\"\"),\"\",0))","v":""},"","","","","",null,null,0,{"$nulls":3},"No"]
[null,77,{"$nulls":5},"",null,"",{"$nulls":4},"",null,"",null,"No",null,"",{"v":0,"d":"0.0000"},"",{"v":0,"d":"0.00"},{"$f":"IF(R96=\"Interior\",IF(AND(L96=\"\",E96=\"\"),\"\",IF(OR(P96>0,O96=\"Enter Watts\",P96=\"\"),P96*N96*(1-X96)/1000,O96*N96(1-X96)/1000)),IF(AND(E96=\"\",L96=\"\"),\"\",0))","v":""},"","","","","",null,null,0,{"$nulls":3},"No"]
[null,78,{"$nulls":5},"",null,"",{"$nulls":4},"",null,"",null,"No",null,"",{"v":0,"d":"0.0000"},"",{"v":0,"d":"0.00"},{"$f":"IF(R97=\"Interior\",IF(AND(L97=\"\",E97=\"\"),\"\",IF(OR(P97>0,O97=\"Enter Watts\",P97=\"\"),P97*N97*(1-X97)/1000,O97*N97(1-X97)/1000)),IF(AND(E97=\"\",L97=\"\"),\"\",0))","v":""},"","","","","",null,null,0,{"$nulls":3},"No"]
[null,79,{"$nulls":5},"",null,"",{"$nulls":4},"",null,"",null,"No",null,"",{"v":0,"d":"0.0000"},"",{"v":0,"d":"0.00"},{"$f":"IF(R98=\"Interior\",IF(AND(L98=\"\",E98=\"\"),\"\",IF(OR(P98>0,O98=\"Enter Watts\",P98=\"\"),P98*N98*(1-X98)/1000,O98*N98(1-X98)/1000)),IF(AND(E98=\"\",L98=\"\"),\"\",0))","v":""},"","","","","",null,null,0,{"$nulls":3},"No"]
[null,80,{"$nulls":5},"",null,"",{"$nulls":4},"",null,"",null,"No",null,"",{"v":0,"d":"0.0000"},"",{"v":0,"d":"0.00"},{"$f":"IF(R99=\"Interior\",IF(AND(L99=\"\",E99=\"\"),\"\",IF(OR(P99>0,O99=\"Enter Watts\",P99=\"\"),P99*N99*(1-X99)/1000,O99*N99(1-X99)/1000)),IF(AND(E99=\"\",L99=\"\"),\"\",0))","v":""},"","","","","",null,null,0,{"$nulls":3},"No"]
[null,81,{"$nulls":5},"",null,"",{"$nulls":4},"",null,"",null,"No",null,"",{"v":0,"d":"0.0000"},"",{"v":0,"d":"0.00"},{"$f":"IF(R100=\"Interior\",IF(AND(L100=\"\",E100=\"\"),\"\",IF(OR(P100>0,O100=\"Enter Watts\",P100=\"\"),P100*N100*(1-X100)/1000,O100*N100(1-X100)/1000)),IF(AND(E100=\"\",L100=\"\"),\"\",0))","v":""},"","","","","",null,null,0,{"$nulls":3},"No"]
[null,82,{"$nulls":5},"",null,"",{"$nulls":4},"",null,"",null,"No",null,"",{"v":0,"d":"0.0000"},"",{"v":0,"d":"0.00"},{"$f":"IF(R101=\"Interior\",IF(AND(L101=\"\",E101=\"\"),\"\",IF(OR(P101>0,O101=\"Enter Watts\",P101=\"\"),P101*N101*(1-X101)/1000,O101*N101(1-X101)/1000)),IF(AND(E101=\"\",L101=\"\"),\"\",0))","v":""},"","","","","",null,null,0,{"$nulls":3},"No"]
[null,83,{"$nulls":5},"",null,"",{"$nulls":4},"",null,"",null,"No",null,"",{"v":0,"d":"0.0000"},"",{"v":0,"d":"0.00"},{"$f":"IF(R102=\"Interior\",IF(AND(L102=\"\",E102=\"\"),\"\",IF(OR(P102>0,O102=\"Enter Watts\",P102=\"\"),P102*N102*(1-X102)/1000,O102*N102(1-X102)/1000)),IF(AND(E102=\"\",L102=\"\"),\"\",0))","v":""},"","","","","",null,null,0,{"$nulls":3},"No"]
[null,84,{"$nulls":5},"",null,"",{"$nulls":4},"",null,"",null,"No",null,"",{"v":0,"d":"0.0000"},"",{"v":0,"d":"0.00"},{"$f":"IF(R103=\"Interior\",IF(AND(L103=\"\",E103=\"\"),\"\",IF(OR(P103>0,O103=\"Enter Watts\",P103=\"\"),P103*N103*(1-X103)/1000,O103*N103(1-X103)/1000)),IF(AND(E103=\"\",L103=\"\"),\"\",0))","v":""},"","","","","",null,null,0,{"$nulls":3},"No"]
[null,85,{"$nulls":5},"",null,"",{"$nulls":4},"",null,"",null,"No",null,"",{"v":0,"d":"0.0000"},"",{"v":0,"d":"0.00"},{"$f":"IF(R104=\"Interior\",IF(AND(L104=\"\",E104=\"\"),\"\",IF(OR(P104>0,O104=\"Enter Watts\",P104=\"\"),P104*N104*(1-X104)/1000,O104*N104(1-X104)/1000)),IF(AND(E104=\"\",L104=\"\"),\"\",0))","v":""},"","","","","",null,null,0,{"$nulls":3},"No",{"$nulls":6},"","",null,""]
[null,86,{"$nulls":5},"",null,"",{"$nulls":4},"",null,"",null,"No",null,"",{"v":0,"d":"0.0000"},"",{"v":0,"d":"0.00"},{"$f":"IF(R105=\"Interior\",IF(AND(L105=\"\",E105=\"\"),\"\",IF(OR(P105>0,O105=\"Enter Watts\",P105=\"\"),P105*N105*(1-X105)/1000,O105*N105(1-X105)/1000)),IF(AND(E105=\"\",L105=\"\"),\"\",0))","v":""},"","","","","",null,null,0,{"$nulls":3},"No"]
[null,87,{"$nulls":5},"",null,"",{"$nulls":4},"",null,"",null,"No",null,"",{"v":0,"d":"0.0000"},"",{"v":0,"d":"0.00"},{"$f":"IF(R106=\"Interior\",IF(AND(L106=\"\",E106=\"\"),\"\",IF(OR(P106>0,O106=\"Enter Watts\",P106=\"\"),P106*N106*(1-X106)/1000,O106*N106(1-X106)/1000)),IF(AND(E106=\"\",L106=\"\"),\"\",0))","v":""},"","","","","",null,null,0,{"$nulls":3},"No"]
[null,88,{"$nulls":5},"",null,"",{"$nulls":4},"",null,"",null,"No",null,"",{"v":0,"d":"0.0000"},"",{"v":0,"d":"0.00"},{"$f":"IF(R107=\"Interior\",IF(AND(L107=\"\",E107=\"\"),\"\",IF(OR(P107>0,O107=\"Enter Watts\",P107=\"\"),P107*N107*(1-X107)/1000,O107*N107(1-X107)/1000)),IF(AND(E107=\"\",L107=\"\"),\"\",0))","v":""},"","","","","",null,null,0,{"$nulls":3},"No"]
[null,89,{"$nulls":5},"",null,"",{"$nulls":4},"",null,"",null,"No",null,"",{"v":0,"d":"0.0000"},"",{"v":0,"d":"0.00"},{"$f":"IF(R108=\"Interior\",IF(AND(L108=\"\",E108=\"\"),\"\",IF(OR(P108>0,O108=\"Enter Watts\",P108=\"\"),P108*N108*(1-X108)/1000,O108*N108(1-X108)/1000)),IF(AND(E108=\"\",L108=\"\"),\"\",0))","v":""},"","","","","",null,null,0,{"$nulls":3},"No"]
[null,90,{"$nulls":5},"",null,"",{"$nulls":4},"",null,"",null,"No",null,"",{"v":0,"d":"0.0000"},"",{"v":0,"d":"0.00"},{"$f":"IF(R109=\"Interior\",IF(AND(L109=\"\",E109=\"\"),\"\",IF(OR(P109>0,O109=\"Enter Watts\",P109=\"\"),P109*N109*(1-X109)/1000,O109*N109(1-X109)/1000)),IF(AND(E109=\"\",L109=\"\"),\"\",0))","v":""},"","","","","",null,null,0,{"$nulls":3},"No"]
[null,91,{"$nulls":5},"",null,"",{"$nulls":4},"",null,"",null,"No",null,"",{"v":0,"d":"0.0000"},"",{"v":0,"d":"0.00"},{"$f":"IF(R110=\"Interior\",IF(AND(L110=\"\",E110=\"\"),\"\",IF(OR(P110>0,O110=\"Enter Watts\",P110=\"\"),P110*N110*(1-X110)/1000,O110*N110(1-X110)/1000)),IF(AND(E110=\"\",L110=\"\"),\"\",0))","v":""},"","","","","",null,null,0,{"$nulls":3},"No",{"$nulls":6},"","",null,""]
[null,92,{"$nulls":5},"",null,"",{"$nulls":4},"",null,"",null,"No",null,"",{"v":0,"d":"0.0000"},"",{"v":0,"d":"0.00"},{"$f":"IF(R111=\"Interior\",IF(AND(L111=\"\",E111=\"\"),\"\",IF(OR(P111>0,O111=\"Enter Watts\",P111=\"\"),P111*N111*(1-X111)/1000,O111*N111(1-X111)/1000)),IF(AND(E111=\"\",L111=\"\"),\"\",0))","v":""},"","","","","",null,null,0,{"$nulls":3},"No"]
[null,93,{"$nulls":5},"",null,"",{"$nulls":4},"",null,"",null,"No",null,"",{"v":0,"d":"0.0000"},"",{"v":0,"d":"0.00"},{"$f":"IF(R112=\"Interior\",IF(AND(L112=\"\",E112=\"\"),\"\",IF(OR(P112>0,O112=\"Enter Watts\",P112=\"\"),P112*N112*(1-X112)/1000,O112*N112(1-X112)/1000)),IF(AND(E112=\"\",L112=\"\"),\"\",0))","v":""},"","","","","",null,null,0,{"$nulls":3},"No"]
[null,94,{"$nulls":5},"",null,"",{"$nulls":4},"",null,"",null,"No",null,"",{"v":0,"d":"0.0000"},"",{"v":0,"d":"0.00"},{"$f":"IF(R113=\"Interior\",IF(AND(L113=\"\",E113=\"\"),\"\",IF(OR(P113>0,O113=\"Enter Watts\",P113=\"\"),P113*N113*(1-X113)/1000,O113*N113(1-X113)/1000)),IF(AND(E113=\"\",L113=\"\"),\"\",0))","v":""},"","","","","",null,null,0,{"$nulls":3},"No"]
[null,95,{"$nulls":5},"",null,"",{"$nulls":4},"",null,"",null,"No",null,"",{"v":0,"d":"0.0000"},"",{"v":0,"d":"0.00"},{"$f":"IF(R114=\"Interior\",IF(AND(L114=\"\",E114=\"\"),\"\",IF(OR(P114>0,O114=\"Enter Watts\",P114=\"\"),P114*N114*(1-X114)/1000,O114*N114(1-X114)/1000)),IF(AND(E114=\"\",L114=\"\"),\"\",0))","v":""},"","","","","",null,null,0,{"$nulls":3},"No"]
[null,96,{"$nulls":5},"",null,"",{"$nulls":4},"",null,"",null,"No",null,"",{"v":0,"d":"0.0000"},"",{"v":0,"d":"0.00"},{"$f":"IF(R115=\"Interior\",IF(AND(L115=\"\",E115=\"\"),\"\",IF(OR(P115>0,O115=\"Enter Watts\",P115=\"\"),P115*N115*(1-X115)/1000,O115*N115(1-X115)/1000)),IF(AND(E115=\"\",L115=\"\"),\"\",0))","v":""},"","","","","",null,null,0,{"$nulls":3},"No"]
[null,97,{"$nulls":5},"",null,"",{"$nulls":4},"",null,"",null,"No",null,"",{"v":0,"d":"0.0000"},"",{"v":0,"d":"0.00"},{"$f":"IF(R116=\"Interior\",IF(AND(L116=\"\",E116=\"\"),\"\",IF(OR(P116>0,O116=\"Enter Watts\",P116=\"\"),P116*N116*(1-X116)/1000,O116*N116(1-X116)/1000)),IF(AND(E116=\"\",L116=\"\"),\"\",0))","v":""},"","","","","",null,null,0,{"$nulls":3},"No"]
[null,98,{"$nulls":5},"",null,"",{"$nulls":4},"",null,"",null,"No",null,"",{"v":0,"d":"0.0000"},"",{"v":0,"d":"0.00"},{"$f":"IF(R117=\"Interior\",IF(AND(L117=\"\",E117=\"\"),\"\",IF(OR(P117>0,O117=\"Enter Watts\",P117=\"\"),P117*N117*(1-X117)/1000,O117*N117(1-X117)/1000)),IF(AND(E117=\"\",L117=\"\"),\"\",0))","v":""},"",{"$f":"IFERROR(IF(OR(I117>0,H117=\"Enter Watts\"),I117*G117,H117*G117)-IF(OR(P117>0,O117=\"Enter Watts\"),P117*N117,O117*N117),\"\")","v":""},"",{"$f":"IF(AND(W117=\"\",Z117=\"\"),\"\",IF(OR(W117=\"\",Z117=\"\"),0,W117-Z117))","v":""},"",null,null,0,{"$nulls":3},"No"]
[null,99,{"$nulls":5},"",null,"",{"$nulls":4},"",null,"",null,"No",null,"",{"v":0,"d":"0.0000"},"",{"v":0,"d":"0.00"},{"$f":"IF(R118=\"Interior\",IF(AND(L118=\"\",E118=\"\"),\"\",IF(OR(P118>0,O118=\"Enter Watts\",P118=\"\"),P118*N118*(1-X118)/1000,O118*N118(1-X118)/1000)),IF(AND(E118=\"\",L118=\"\"),\"\",0))","v":""},"",{"$f":"IFERROR(IF(OR(I118>0,H118=\"Enter Watts\"),I118*G118,H118*G118)-IF(OR(P118>0,O118=\"Enter Watts\"),P118*N118,O118*N118),\"\")","v":""},"",{"$f":"IF(AND(W118=\"\",Z118=\"\"),\"\",IF(OR(W118=\"\",Z118=\"\"),0,W118-Z118))","v":""},"",null,null,0,{"$nulls":3},"No"]
[null,100,{"$nulls":5},"",null,"",{"$nulls":4},"",null,"",null,"No",null,"",{"v":0,"d":"0.0000"},"",{"v":0,"d":"0.00"},{"$f":"IF(R119=\"Interior\",IF(AND(L119=\"\",E119=\"\"),\"\",IF(OR(P119>0,O119=\"Enter Watts\",P119=\"\"),P119*N119*(1-X119)/1000,O119*N119(1-X119)/1000)),IF(AND(E119=\"\",L119=\"\"),\"\",0))","v":""},"","","","","",null,null,0,{"$nulls":3},"No"]
[null,101,{"$nulls":5},"",null,"",{"$nulls":4},"",null,"",null,"No",null,"",{"v":0,"d":"0.0000"},"",{"v":0,"d":"0.00"},{"$f":"IF(R120=\"Interior\",IF(AND(L120=\"\",E120=\"\"),\"\",IF(OR(P120>0,O120=\"Enter Watts\",P120=\"\"),P120*N120*(1-X120)/1000,O120*N120(1-X120)/1000)),IF(AND(E120=\"\",L120=\"\"),\"\",0))","v":""},"","","","","",null,null,0,{"$nulls":3},"No"]
[null,102,{"$nulls":5},"",null,"",{"$nulls":4},"",null,"",null,"No",null,"",{"v":0,"d":"0.0000"},"",{"v":0,"d":"0.00"},{"$f":"IF(R121=\"Interior\",IF(AND(L121=\"\",E121=\"\"),\"\",IF(OR(P121>0,O121=\"Enter Watts\",P121=\"\"),P121*N121*(1-X121)/1000,O121*N121(1-X121)/1000)),IF(AND(E121=\"\",L121=\"\"),\"\",0))","v":""},"","","","","",null,null,0,{"$nulls":3},"No",{"$nulls":6},"","",null,""]
[null,103,{"$nulls":5},"",null,"",{"$nulls":4},"",null,"",null,"No",null,"",{"v":0,"d":"0.0000"},"",{"v":0,"d":"0.00"},{"$f":"IF(R122=\"Interior\",IF(AND(L122=\"\",E122=\"\"),\"\",IF(OR(P122>0,O122=\"Enter Watts\",P122=\"\"),P122*N122*(1-X122)/1000,O122*N122(1-X122)/1000)),IF(AND(E122=\"\",L122=\"\"),\"\",0))","v":""},"","","","","",null,null,0,{"$nulls":3},"No"]
[null,104,{"$nulls":5},"",null,"",{"$nulls":4},"",null,"",null,"No",null,"",{"v":0,"d":"0.0000"},"",{"v":0,"d":"0.00"},{"$f":"IF(R123=\"Interior\",IF(AND(L123=\"\",E123=\"\"),\"\",IF(OR(P123>0,O123=\"Enter Watts\",P123=\"\"),P123*N123*(1-X123)/1000,O123*N123(1-X123)/1000)),IF(AND(E123=\"\",L123=\"\"),\"\",0))","v":""},"","","","","",null,null,0,{"$nulls":3},"No"]
[null,105,{"$nulls":5},"",null,"",{"$nulls":4},"",null,"",null,"No",null,"",{"v":0,"d":"0.0000"},"",{"v":0,"d":"0.00"},{"$f":"IF(R124=\"Interior\",IF(AND(L124=\"\",E124=\"\"),\"\",IF(OR(P124>0,O124=\"Enter Watts\",P124=\"\"),P124*N124*(1-X124)/1000,O124*N124(1-X124)/1000)),IF(AND(E124=\"\",L124=\"\"),\"\",0))","v":""},"","","","","",null,null,0,{"$nulls":3},"No"]
[null,106,{"$nulls":5},"",null,"",{"$nulls":4},"",null,"",null,"No",null,"",{"v":0,"d":"0.0000"},"",{"v":0,"d":"0.00"},{"$f":"IF(R125=\"Interior\",IF(AND(L125=\"\",E125=\"\"),\"\",IF(OR(P125>0,O125=\"Enter Watts\",P125=\"\"),P125*N125*(1-X125)/1000,O125*N125(1-X125)/1000)),IF(AND(E125=\"\",L125=\"\"),\"\",0))","v":""},"","","","","",null,null,0,{"$nulls":3},"No"]
[null,107,{"$nulls":5},"",null,"",{"$nulls":4},"",null,"",null,"No",null,"",{"v":0,"d":"0.0000"},"",{"v":0,"d":"0.00"},{"$f":"IF(R126=\"Interior\",IF(AND(L126=\"\",E126=\"\"),\"\",IF(OR(P126>0,O126=\"Enter Watts\",P126=\"\"),P126*N126*(1-X126)/1000,O126*N126(1-X126)/1000)),IF(AND(E126=\"\",L126=\"\"),\"\",0))","v":""},"","","","","",null,null,0,{"$nulls":3},"No"]
[null,108,{"$nulls":5},"",null,"",{"$nulls":4},"",null,{"$f":"IF(J127=\"\",\"\",J127)","v":""},null,"No",null,"",{"v":0,"d":"0.0000"},"",{"v":0,"d":"0.00"},{"$f":"IF(R127=\"Interior\",IF(AND(L127=\"\",E127=\"\"),\"\",IF(OR(P127>0,O127=\"Enter Watts\",P127=\"\"),P127*N127*(1-X127)/1000,O127*N127(1-X127)/1000)),IF(AND(E127=\"\",L127=\"\"),\"\",0))","v":""},"",{"$f":"IFERROR(IF(OR(I127>0,H127=\"Enter Watts\"),I127*G127,H127*G127)-IF(OR(P127>0,O127=\"Enter Watts\"),P127*N127,O127*N127),\"\")","v":""},"",{"$f":"IF(AND(W127=\"\",Z127=\"\"),\"\",IF(OR(W127=\"\",Z127=\"\"),0,W127-Z127))","v":""},"",null,null,0,{"$nulls":3},"No"]
[null,109,{"$nulls":5},"",null,"",{"$nulls":4},"",null,"",null,"No",null,"",{"v":0,"d":"0.0000"},"",{"v":0,"d":"0.00"},{"$f":"IF(R128=\"Interior\",IF(AND(L128=\"\",E128=\"\"),\"\",IF(OR(P128>0,O128=\"Enter Watts\",P128=\"\"),P128*N128*(1-X128)/1000,O128*N128(1-X128)/1000)),IF(AND(E128=\"\",L128=\"\"),\"\",0))","v":""},"",{"$f":"IFERROR(IF(OR(I128>0,H128=\"Enter Watts\"),I128*G128,H128*G128)-IF(OR(P128>0,O128=\"Enter Watts\"),P128*N128,O128*N128),\"\")","v":""},"",{"$f":"IF(AND(W128=\"\",Z128=\"\"),\"\",IF(OR(W128=\"\",Z128=\"\"),0,W128-Z128))","v":""},"",null,null,0,{"$nulls":3},"No"]
[null,110,{"$nulls":5},"",null,"",{"$nulls":4},"",null,"",null,"No",null,"",{"v":0,"d":"0.0000"},"",{"v":0,"d":"0.00"},{"$f":"IF(R129=\"Interior\",IF(AND(L129=\"\",E129=\"\"),\"\",IF(OR(P129>0,O129=\"Enter Watts\",P129=\"\"),P129*N129*(1-X129)/1000,O129*N129(1-X129)/1000)),IF(AND(E129=\"\",L129=\"\"),\"\",0))","v":""},"","","","","",null,null,0,{"$nulls":3},"No"]
[null,111,{"$nulls":5},"",null,"",{"$nulls":4},"",null,"",null,"No",null,"",{"v":0,"d":"0.0000"},"",{"v":0,"d":"0.00"},{"$f":"IF(R130=\"Interior\",IF(AND(L130=\"\",E130=\"\"),\"\",IF(OR(P130>0,O130=\"Enter Watts\",P130=\"\"),P130*N130*(1-X130)/1000,O130*N130(1-X130)/1000)),IF(AND(E130=\"\",L130=\"\"),\"\",0))","v":""},"","","","","",null,null,0,{"$nulls":3},"No"]
[null,112,{"$nulls":5},"",null,"",{"$nulls":4},"",null,"",null,"No",null,"",{"v":0,"d":"0.0000"},"",{"v":0,"d":"0.00"},{"$f":"IF(R131=\"Interior\",IF(AND(L131=\"\",E131=\"\"),\"\",IF(OR(P131>0,O131=\"Enter Watts\",P131=\"\"),P131*N131*(1-X131)/1000,O131*N131(1-X131)/1000)),IF(AND(E131=\"\",L131=\"\"),\"\",0))","v":""},"","","","","",null,null,0,{"$nulls":3},"No",{"$nulls":6},"","",null,""]
[null,113,{"$nulls":5},"",null,"",{"$nulls":4},"",null,"",null,"No",null,"",{"v":0,"d":"0.0000"},"",{"v":0,"d":"0.00"},{"$f":"IF(R132=\"Interior\",IF(AND(L132=\"\",E132=\"\"),\"\",IF(OR(P132>0,O132=\"Enter Watts\",P132=\"\"),P132*N132*(1-X132)/1000,O132*N132(1-X132)/1000)),IF(AND(E132=\"\",L132=\"\"),\"\",0))","v":""},"","","","","",null,null,0,{"$nulls":3},"No"]
[null,114,{"$nulls":5},"",null,"",{"$nulls":4},"",null,"",null,"No",null,"",{"v":0,"d":"0.0000"},"",{"v":0,"d":"0.00"},{"$f":"IF(R133=\"Interior\",IF(AND(L133=\"\",E133=\"\"),\"\",IF(OR(P133>0,O133=\"Enter Watts\",P133=\"\"),P133*N133*(1-X133)/1000,O133*N133(1-X133)/1000)),IF(AND(E133=\"\",L133=\"\"),\"\",0))","v":""},"","","","","",null,null,0,{"$nulls":3},"No"]
[null,115,{"$nulls":5},"",null,"",{"$nulls":4},"",null,"",null,"No",null,"",{"v":0,"d":"0.0000"},"",{"v":0,"d":"0.00"},{"$f":"IF(R134=\"Interior\",IF(AND(L134=\"\",E134=\"\"),\"\",IF(OR(P134>0,O134=\"Enter Watts\",P134=\"\"),P134*N134*(1-X134)/1000,O134*N134(1-X134)/1000)),IF(AND(E134=\"\",L134=\"\"),\"\",0))","v":""},"","","","","",null,null,0,{"$nulls":3},"No"]
[null,116,{"$nulls":5},"",null,"",{"$nulls":4},"",null,"",null,"No",null,"",{"v":0,"d":"0.0000"},"",{"v":0,"d":"0.00"},{"$f":"IF(R135=\"Interior\",IF(AND(L135=\"\",E135=\"\"),\"\",IF(OR(P135>0,O135=\"Enter Watts\",P135=\"\"),P135*N135*(1-X135)/1000,O135*N135(1-X135)/1000)),IF(AND(E135=\"\",L135=\"\"),\"\",0))","v":""},"","","","","",null,null,0,{"$nulls":3},"No"]
[null,117,{"$nulls":5},"",null,"",{"$nulls":4},"",null,"",null,"No",null,"",{"v":0,"d":"0.0000"},"",{"v":0,"d":"0.00"},{"$f":"IF(R136=\"Interior\",IF(AND(L136=\"\",E136=\"\"),\"\",IF(OR(P136>0,O136=\"Enter Watts\",P136=\"\"),P136*N136*(1-X136)/1000,O136*N136(1-X136)/1000)),IF(AND(E136=\"\",L136=\"\"),\"\",0))","v":""},"","","","","",null,null,0,{"$nulls":3},"No"]
[null,118,{"$nulls":5},"",null,"",{"$nulls":4},"",null,"",null,"No",null,"",{"v":0,"d":"0.0000"},"",{"v":0,"d":"0.00"},{"$f":"IF(R137=\"Interior\",IF(AND(L137=\"\",E137=\"\"),\"\",IF(OR(P137>0,O137=\"Enter Watts\",P137=\"\"),P137*N137*(1-X137)/1000,O137*N137(1-X137)/1000)),IF(AND(E137=\"\",L137=\"\"),\"\",0))","v":""},"","","","","",null,null,0,{"$nulls":3},"No",{"$nulls":6},"","",null,""]
[null,119,{"$nulls":5},"",null,"",{"$nulls":4},"",null,"",null,"No",null,"",{"v":0,"d":"0.0000"},"",{"v":0,"d":"0.00"},{"$f":"IF(R138=\"Interior\",IF(AND(L138=\"\",E138=\"\"),\"\",IF(OR(P138>0,O138=\"Enter Watts\",P138=\"\"),P138*N138*(1-X138)/1000,O138*N138(1-X138)/1000)),IF(AND(E138=\"\",L138=\"\"),\"\",0))","v":""},"","","","","",null,null,0,{"$nulls":3},"No"]
[null,120,{"$nulls":5},"",null,"",{"$nulls":4},"",null,"",null,"No",null,"",{"v":0,"d":"0.0000"},"",{"v":0,"d":"0.00"},{"$f":"IF(R139=\"Interior\",IF(AND(L139=\"\",E139=\"\"),\"\",IF(OR(P139>0,O139=\"Enter Watts\",P139=\"\"),P139*N139*(1-X139)/1000,O139*N139(1-X139)/1000)),IF(AND(E139=\"\",L139=\"\"),\"\",0))","v":""},"","","","","",null,null,0,{"$nulls":3},"No"]
[null,121,{"$nulls":5},"",null,"",{"$nulls":4},"",null,"",null,"No",null,"",{"v":0,"d":"0.0000"},"",{"v":0,"d":"0.00"},{"$f":"IF(R140=\"Interior\",IF(AND(L140=\"\",E140=\"\"),\"\",IF(OR(P140>0,O140=\"Enter Watts\",P140=\"\"),P140*N140*(1-X140)/1000,O140*N140(1-X140)/1000)),IF(AND(E140=\"\",L140=\"\"),\"\",0))","v":""},"","","","","",null,null,0,{"$nulls":3},"No"]
[null,122,{"$nulls":5},"",null,"",{"$nulls":4},"",null,"",null,"No",null,"",{"v":0,"d":"0.0000"},"",{"v":0,"d":"0.00"},{"$f":"IF(R141=\"Interior\",IF(AND(L141=\"\",E141=\"\"),\"\",IF(OR(P141>0,O141=\"Enter Watts\",P141=\"\"),P141*N141*(1-X141)/1000,O141*N141(1-X141)/1000)),IF(AND(E141=\"\",L141=\"\"),\"\",0))","v":""},"","","","","",null,null,0,{"$nulls":3},"No"]
[null,123,{"$nulls":5},"",null,"",{"$nulls":4},"",null,"",null,"No",null,"",{"v":0,"d":"0.0000"},"",{"v":0,"d":"0.00"},{"$f":"IF(R142=\"Interior\",IF(AND(L142=\"\",E142=\"\"),\"\",IF(OR(P142>0,O142=\"Enter Watts\",P142=\"\"),P142*N142*(1-X142)/1000,O142*N142(1-X142)/1000)),IF(AND(E142=\"\",L142=\"\"),\"\",0))","v":""},"","","","","",null,null,0,{"$nulls":3},"No"]
[null,124,{"$nulls":5},"",null,"",{"$nulls":4},"",null,"",null,"No",null,"",{"v":0,"d":"0.0000"},"",{"v":0,"d":"0.00"},{"$f":"IF(R143=\"Interior\",IF(AND(L143=\"\",E143=\"\"),\"\",IF(OR(P143>0,O143=\"Enter Watts\",P143=\"\"),P143*N143*(1-X143)/1000,O143*N143(1-X143)/1000)),IF(AND(E143=\"\",L143=\"\"),\"\",0))","v":""},"","","","","",null,null,0,{"$nulls":3},"No"]
[null,125,{"$nulls":5},"",null,"",{"$nulls":4},"",null,"",null,"No",null,"",{"v":0,"d":"0.0000"},"",{"v":0,"d":"0.00"},{"$f":"IF(R144=\"Interior\",IF(AND(L144=\"\",E144=\"\"),\"\",IF(OR(P144>0,O144=\"Enter Watts\",P144=\"\"),P144*N144*(1-X144)/1000,O144*N144(1-X144)/1000)),IF(AND(E144=\"\",L144=\"\"),\"\",0))","v":""},"","","","","",null,null,0,{"$nulls":3},"No",{"$nulls":6},"","",null,""]
[null,126,{"$nulls":5},"",null,"",{"$nulls":4},"",null,"",null,"No",null,"",{"v":0,"d":"0.0000"},"",{"v":0,"d":"0.00"},{"$f":"IF(R145=\"Interior\",IF(AND(L145=\"\",E145=\"\"),\"\",IF(OR(P145>0,O145=\"Enter Watts\",P145=\"\"),P145*N145*(1-X145)/1000,O145*N145(1-X145)/1000)),IF(AND(E145=\"\",L145=\"\"),\"\",0))","v":""},"","","","","",null,null,0,{"$nulls":3},"No"]
[null,127,{"$nulls":5},"",null,"",{"$nulls":4},"",null,"",null,"No",null,"",{"v":0,"d":"0.0000"},"",{"v":0,"d":"0.00"},{"$f":"IF(R146=\"Interior\",IF(AND(L146=\"\",E146=\"\"),\"\",IF(OR(P146>0,O146=\"Enter Watts\",P146=\"\"),P146*N146*(1-X146)/1000,O146*N146(1-X146)/1000)),IF(AND(E146=\"\",L146=\"\"),\"\",0))","v":""},"","","","","",null,null,0,{"$nulls":3},"No"]
[null,128,{"$nulls":5},"",null,"",{"$nulls":4},"",null,"",null,"No",null,"",{"v":0,"d":"0.0000"},"",{"v":0,"d":"0.00"},{"$f":"IF(R147=\"Interior\",IF(AND(L147=\"\",E147=\"\"),\"\",IF(OR(P147>0,O147=\"Enter Watts\",P147=\"\"),P147*N147*(1-X147)/1000,O147*N147(1-X147)/1000)),IF(AND(E147=\"\",L147=\"\"),\"\",0))","v":""},"","","","","",null,null,0,{"$nulls":3},"No"]
[null,129,{"$nulls":5},{"$f":"IF(E148=\"\",\"\",VLOOKUP(E148,$AQ$1114:$AR$1541,2,FALSE))","v":""},null,{"$f":"IF(AND(E148<>\"\",G148<>\"\",$E$8=\"Default Sector Hours\"),VLOOKUP(IF(R148=\"Exterior\",\"Exterior\",$E$7),$W$1036:$X$1041,2,FALSE),\"\")","v":""},{"$nulls":4},{"$f":"IF(L148=\"\",\"\",VLOOKUP(L148,$AQ$1113:$AR$1541,2,FALSE))","v":""},null,"",null,"No",null,"",{"v":0,"d":"0.0000"},"",{"v":0,"d":"0.00"},{"$f":"IF(R148=\"Interior\",IF(AND(L148=\"\",E148=\"\"),\"\",IF(OR(P148>0,O148=\"Enter Watts\",P148=\"\"),P148*N148*(1-X148)/1000,O148*N148(1-X148)/1000)),IF(AND(E148=\"\",L148=\"\"),\"\",0))","v":""},{"$f":"IFERROR(IF(AND(L148=\"\", E148=\"\"),\"\",N148/1000*IF(OR(P148>0,O148=\"Enter Watts\"),P148,O148)*IF(R148=\"Exterior\",$X$1041,IF($E$8=\"Manual Input\",Q148,VLOOKUP($E$7,$W$1036:$Z$1040,2,FALSE)))*IF(S148=\"Yes\",IF(R148=\"Exterior\",1-$Z$1041,1-VLOOKUP($E$7,$W$1036:$Z$1040,4,FALSE)),1)),0)","v":""},"",{"$f":"IF(AND(U148=\"\",Y148=\"\"),\"\",IF(OR(U148=\"\",Y148=\"\"),0,  IF($E$8=\"Manual Input\",$G$9,   VLOOKUP($E$7,$W$1036:$Z$1041,3,FALSE))     *(U148-Y148)))","v":""},"",{"$f":"IF(AC148=\"\",\"\",IF(AND(R148=\"Interior\",S148=\"No\",OR(T148=\"\",T148=\"No\")),$J$1027,IF(AND(R148=\"Interior\",S148=\"Yes\"),$J$1028,IF(AND(R148=\"Exterior\",S148=\"Yes\"),$J$1029,IF(AND(R148=\"Exterior\",S148=\"No\",N148<>G148),\"DNQ\",\"See Lighting Catalog to determine Code\")))))","v":""},null,null,0,{"$nulls":3},"No"]
[null,130,{"$nulls":5},"",null,"",{"$nulls":4},"",null,"",null,"No",null,{"$f":"IF(V149=\"Int Control\",IF(E149=\"\",\"\",IF(OR(I149>0,H149=\"Enter Watts\"),I149*G149/1000*(1-$E$15),H149*G149/1000*(1-$E$15))),IF(E149=\"\",\"\",IF(OR(I149>0,H149=\"Enter Watts\"),I149*G149/1000,H149*G149/1000)))","v":""},{"$f":"IF(AND(R149=\"Interior\",S149=\"Yes\"),\"Int Control\",0)","v":{"v":0,"d":"0.0000"}},{"$f":"IFERROR(IF(V149=\"Int Control\",IF(E149=\"\",\"\",G149/1000*(1-$E$15)*IF(OR(I149>0,H149=\"Enter Watts\"),I149,H149)*IF(R149=\"Exterior\",$X$1041*(1-$G$15),IF($E$8=\"Manual Input\",J149,VLOOKUP($E$7,$W$1036:$Z$1040,2,FALSE)*(1-$E$15)))),IF(E149=\"\",\"\",G149/1000*IF(OR(I149>0,H149=\"Enter Watts\"),I149,H149)*IF(R149=\"Exterior\",$X$1041,IF($E$8=\"Manual Input\",J149,VLOOKUP($E$7,$W$1036:$Z$1040,2,FALSE))))),\"0\")","v":""},{"$f":"IF(S149=\"No\",0,AA$1036)","v":{"v":0,"d":"0.00"}},{"$f":"IF(R149=\"Interior\",IF(AND(L149=\"\",E149=\"\"),\"\",IF(OR(P149>0,O149=\"Enter Watts\",P149=\"\"),P149*N149*(1-X149)/1000,O149*N149(1-X149)/1000)),IF(AND(E149=\"\",L149=\"\"),\"\",0))","v":""},"","","","","",null,null,{"$f":"AF149*N149","v":0},{"$nulls":3},{"$f":"IF(_xlfn.ISFORMULA(J149)=TRUE,\"No\",\"Yes\")","v":"No"}]
[null,131,{"$nulls":5},"",null,"",{"$nulls":4},"",null,"",null,"No",null,"",{"v":0,"d":"0.0000"},"",{"v":0,"d":"0.00"},{"$f":"IF(R150=\"Interior\",IF(AND(L150=\"\",E150=\"\"),\"\",IF(OR(P150>0,O150=\"Enter Watts\",P150=\"\"),P150*N150*(1-X150)/1000,O150*N150(1-X150)/1000)),IF(AND(E150=\"\",L150=\"\"),\"\",0))","v":""},"","","","","",null,null,0,{"$nulls":3},"No",{"$nulls":6},"","",null,""]
[null,132,{"$nulls":5},"",null,"",{"$nulls":4},"",null,"",null,"No",null,"",{"v":0,"d":"0.0000"},"",{"v":0,"d":"0.00"},{"$f":"IF(R151=\"Interior\",IF(AND(L151=\"\",E151=\"\"),\"\",IF(OR(P151>0,O151=\"Enter Watts\",P151=\"\"),P151*N151*(1-X151)/1000,O151*N151(1-X151)/1000)),IF(AND(E151=\"\",L151=\"\"),\"\",0))","v":""},"","","","","",null,null,0,{"$nulls":3},"No"]
[null,133,{"$nulls":5},"",null,"",{"$nulls":4},"",null,"",null,"No",null,"",{"v":0,"d":"0.0000"},"",{"v":0,"d":"0.00"},{"$f":"IF(R152=\"Interior\",IF(AND(L152=\"\",E152=\"\"),\"\",IF(OR(P152>0,O152=\"Enter Watts\",P152=\"\"),P152*N152*(1-X152)/1000,O152*N152(1-X152)/1000)),IF(AND(E152=\"\",L152=\"\"),\"\",0))","v":""},"","","","","",null,null,0,{"$nulls":3},"No"]
[null,134,{"$nulls":5},"",null,"",{"$nulls":4},"",null,"",null,"No",null,"",{"v":0,"d":"0.0000"},"",{"v":0,"d":"0.00"},{"$f":"IF(R153=\"Interior\",IF(AND(L153=\"\",E153=\"\"),\"\",IF(OR(P153>0,O153=\"Enter Watts\",P153=\"\"),P153*N153*(1-X153)/1000,O153*N153(1-X153)/1000)),IF(AND(E153=\"\",L153=\"\"),\"\",0))","v":""},"","","","","",null,null,0,{"$nulls":3},"No"]
[null,135,{"$nulls":5},"",null,"",{"$nulls":4},"",null,"",null,"No",null,"",{"v":0,"d":"0.0000"},"",{"v":0,"d":"0.00"},{"$f":"IF(R154=\"Interior\",IF(AND(L154=\"\",E154=\"\"),\"\",IF(OR(P154>0,O154=\"Enter Watts\",P154=\"\"),P154*N154*(1-X154)/1000,O154*N154(1-X154)/1000)),IF(AND(E154=\"\",L154=\"\"),\"\",0))","v":""},"","","","","",null,null,0,{"$nulls":3},"No"]
[null,136,{"$nulls":5},"",null,"",{"$nulls":4},"",null,"",null,"No",null,"",{"v":0,"d":"0.0000"},"",{"v":0,"d":"0.00"},{"$f":"IF(R155=\"Interior\",IF(AND(L155=\"\",E155=\"\"),\"\",IF(OR(P155>0,O155=\"Enter Watts\",P155=\"\"),P155*N155*(1-X155)/1000,O155*N155(1-X155)/1000)),IF(AND(E155=\"\",L155=\"\"),\"\",0))","v":""},"","","","","",null,null,0,{"$nulls":3},"No"]
[null,137,{"$nulls":5},"",null,"",{"$nulls":4},"",null,"",null,"No",null,"",{"v":0,"d":"0.0000"},"",{"v":0,"d":"0.00"},{"$f":"IF(R156=\"Interior\",IF(AND(L156=\"\",E156=\"\"),\"\",IF(OR(P156>0,O156=\"Enter Watts\",P156=\"\"),P156*N156*(1-X156)/1000,O156*N156(1-X156)/1000)),IF(AND(E156=\"\",L156=\"\"),\"\",0))","v":""},"","","","","",null,null,0,{"$nulls":3},"No"]
[null,138,{"$nulls":5},"",null,"",{"$nulls":4},"",null,"",null,"No",null,"",{"v":0,"d":"0.0000"},"",{"v":0,"d":"0.00"},{"$f":"IF(R157=\"Interior\",IF(AND(L157=\"\",E157=\"\"),\"\",IF(OR(P157>0,O157=\"Enter Watts\",P157=\"\"),P157*N157*(1-X157)/1000,O157*N157(1-X157)/1000)),IF(AND(E157=\"\",L157=\"\"),\"\",0))","v":""},"","","","","",null,null,0,{"$nulls":3},"No"]
[null,139,{"$nulls":5},"",null,"",{"$nulls":4},"",null,"",null,"No",null,"",{"v":0,"d":"0.0000"},"",{"v":0,"d":"0.00"},{"$f":"IF(R158=\"Interior\",IF(AND(L158=\"\",E158=\"\"),\"\",IF(OR(P158>0,O158=\"Enter Watts\",P158=\"\"),P158*N158*(1-X158)/1000,O158*N158(1-X158)/1000)),IF(AND(E158=\"\",L158=\"\"),\"\",0))","v":""},"","","","","",null,null,0,{"$nulls":3},"No"]
[null,140,{"$nulls":5},"",null,"",{"$nulls":4},"",null,"",null,"No",null,"",{"v":0,"d":"0.0000"},"",{"v":0,"d":"0.00"},{"$f":"IF(R159=\"Interior\",IF(AND(L159=\"\",E159=\"\"),\"\",IF(OR(P159>0,O159=\"Enter Watts\",P159=\"\"),P159*N159*(1-X159)/1000,O159*N159(1-X159)/1000)),IF(AND(E159=\"\",L159=\"\"),\"\",0))","v":""},"","","","","",null,null,0,{"$nulls":3},"No"]
[null,141,{"$nulls":5},"",null,"",{"$nulls":4},"",null,"",null,"No",null,"",{"v":0,"d":"0.0000"},"",{"v":0,"d":"0.00"},{"$f":"IF(R160=\"Interior\",IF(AND(L160=\"\",E160=\"\"),\"\",IF(OR(P160>0,O160=\"Enter Watts\",P160=\"\"),P160*N160*(1-X160)/1000,O160*N160(1-X160)/1000)),IF(AND(E160=\"\",L160=\"\"),\"\",0))","v":""},"","","","","",null,null,0,{"$nulls":3},"No"]
[null,142,{"$nulls":5},"",null,"",{"$nulls":4},"",null,"",null,"No",null,"",{"v":0,"d":"0.0000"},"",{"v":0,"d":"0.00"},{"$f":"IF(R161=\"Interior\",IF(AND(L161=\"\",E161=\"\"),\"\",IF(OR(P161>0,O161=\"Enter Watts\",P161=\"\"),P161*N161*(1-X161)/1000,O161*N161(1-X161)/1000)),IF(AND(E161=\"\",L161=\"\"),\"\",0))","v":""},"","","","","",null,null,0,{"$nulls":3},"No"]
[null,143,{"$nulls":5},"",null,"",{"$nulls":4},"",null,"",null,"No",null,"",{"v":0,"d":"0.0000"},"",{"v":0,"d":"0.00"},{"$f":"IF(R162=\"Interior\",IF(AND(L162=\"\",E162=\"\"),\"\",IF(OR(P162>0,O162=\"Enter Watts\",P162=\"\"),P162*N162*(1-X162)/1000,O162*N162(1-X162)/1000)),IF(AND(E162=\"\",L162=\"\"),\"\",0))","v":""},"","","","","",null,null,0,{"$nulls":3},"No",{"$nulls":6},"","",null,""]
[null,144,{"$nulls":5},"",null,"",{"$nulls":4},"",null,"",null,"No",null,"",{"v":0,"d":"0.0000"},"",{"v":0,"d":"0.00"},{"$f":"IF(R163=\"Interior\",IF(AND(L163=\"\",E163=\"\"),\"\",IF(OR(P163>0,O163=\"Enter Watts\",P163=\"\"),P163*N163*(1-X163)/1000,O163*N163(1-X163)/1000)),IF(AND(E163=\"\",L163=\"\"),\"\",0))","v":""},"","","","","",null,null,0,{"$nulls":3},"No"]
[null,145,{"$nulls":5},"",null,"",{"$nulls":4},"",null,"",null,"No",null,"",{"v":0,"d":"0.0000"},"",{"v":0,"d":"0.00"},{"$f":"IF(R164=\"Interior\",IF(AND(L164=\"\",E164=\"\"),\"\",IF(OR(P164>0,O164=\"Enter Watts\",P164=\"\"),P164*N164*(1-X164)/1000,O164*N164(1-X164)/1000)),IF(AND(E164=\"\",L164=\"\"),\"\",0))","v":""},"","","","","",null,null,0,{"$nulls":3},"No"]
[null,146,{"$nulls":5},"",null,"",{"$nulls":4},"",null,"",null,"No",null,"",{"v":0,"d":"0.0000"},"",{"v":0,"d":"0.00"},{"$f":"IF(R165=\"Interior\",IF(AND(L165=\"\",E165=\"\"),\"\",IF(OR(P165>0,O165=\"Enter Watts\",P165=\"\"),P165*N165*(1-X165)/1000,O165*N165(1-X165)/1000)),IF(AND(E165=\"\",L165=\"\"),\"\",0))","v":""},"","","","","",null,null,0,{"$nulls":3},"No"]
[null,147,{"$nulls":5},"",null,"",{"$nulls":4},"",null,"",null,"No",null,"",{"v":0,"d":"0.0000"},"",{"v":0,"d":"0.00"},{"$f":"IF(R166=\"Interior\",IF(AND(L166=\"\",E166=\"\"),\"\",IF(OR(P166>0,O166=\"Enter Watts\",P166=\"\"),P166*N166*(1-X166)/1000,O166*N166(1-X166)/1000)),IF(AND(E166=\"\",L166=\"\"),\"\",0))","v":""},"","","","","",null,null,0,{"$nulls":3},"No"]
[null,148,{"$nulls":5},"",null,"",{"$nulls":4},"",null,"",null,"No",null,"",{"v":0,"d":"0.0000"},"",{"v":0,"d":"0.00"},{"$f":"IF(R167=\"Interior\",IF(AND(L167=\"\",E167=\"\"),\"\",IF(OR(P167>0,O167=\"Enter Watts\",P167=\"\"),P167*N167*(1-X167)/1000,O167*N167(1-X167)/1000)),IF(AND(E167=\"\",L167=\"\"),\"\",0))","v":""},"","","","","",null,null,0,{"$nulls":3},"No"]
[null,149,{"$nulls":5},"",null,"",{"$nulls":4},"",null,"",null,"No",null,"",{"v":0,"d":"0.0000"},"",{"v":0,"d":"0.00"},{"$f":"IF(R168=\"Interior\",IF(AND(L168=\"\",E168=\"\"),\"\",IF(OR(P168>0,O168=\"Enter Watts\",P168=\"\"),P168*N168*(1-X168)/1000,O168*N168(1-X168)/1000)),IF(AND(E168=\"\",L168=\"\"),\"\",0))","v":""},"","","","","",null,null,0,{"$nulls":3},"No",{"$nulls":6},"","",null,""]
[null,150,{"$nulls":5},"",null,"",{"$nulls":4},"",null,"",null,"No",null,"",{"v":0,"d":"0.0000"},"",{"v":0,"d":"0.00"},{"$f":"IF(R169=\"Interior\",IF(AND(L169=\"\",E169=\"\"),\"\",IF(OR(P169>0,O169=\"Enter Watts\",P169=\"\"),P169*N169*(1-X169)/1000,O169*N169(1-X169)/1000)),IF(AND(E169=\"\",L169=\"\"),\"\",0))","v":""},"","","","","",null,null,0,{"$nulls":3},"No"]
[null,151,{"$nulls":5},"",null,"",{"$nulls":4},"",null,"",null,"No",null,"",{"v":0,"d":"0.0000"},"",{"v":0,"d":"0.00"},{"$f":"IF(R170=\"Interior\",IF(AND(L170=\"\",E170=\"\"),\"\",IF(OR(P170>0,O170=\"Enter Watts\",P170=\"\"),P170*N170*(1-X170)/1000,O170*N170(1-X170)/1000)),IF(AND(E170=\"\",L170=\"\"),\"\",0))","v":""},"","","","","",null,null,0,{"$nulls":3},"No"]
[null,152,{"$nulls":5},"",null,"",{"$nulls":4},"",null,"",null,"No",null,"",{"v":0,"d":"0.0000"},"",{"v":0,"d":"0.00"},{"$f":"IF(R171=\"Interior\",IF(AND(L171=\"\",E171=\"\"),\"\",IF(OR(P171>0,O171=\"Enter Watts\",P171=\"\"),P171*N171*(1-X171)/1000,O171*N171(1-X171)/1000)),IF(AND(E171=\"\",L171=\"\"),\"\",0))","v":""},"","","","","",null,null,0,{"$nulls":3},"No"]
[null,153,{"$nulls":5},"",null,"",{"$nulls":4},"",null,"",null,"No",null,"",{"v":0,"d":"0.0000"},"",{"v":0,"d":"0.00"},{"$f":"IF(R172=\"Interior\",IF(AND(L172=\"\",E172=\"\"),\"\",IF(OR(P172>0,O172=\"Enter Watts\",P172=\"\"),P172*N172*(1-X172)/1000,O172*N172(1-X172)/1000)),IF(AND(E172=\"\",L172=\"\"),\"\",0))","v":""},"","","","","",null,null,0,{"$nulls":3},"No"]
[null,154,{"$nulls":5},"",null,"",{"$nulls":4},"",null,"",null,"No",null,"",{"v":0,"d":"0.0000"},"",{"v":0,"d":"0.00"},{"$f":"IF(R173=\"Interior\",IF(AND(L173=\"\",E173=\"\"),\"\",IF(OR(P173>0,O173=\"Enter Watts\",P173=\"\"),P173*N173*(1-X173)/1000,O173*N173(1-X173)/1000)),IF(AND(E173=\"\",L173=\"\"),\"\",0))","v":""},"","","","","",null,null,0,{"$nulls":3},"No"]
[null,155,{"$nulls":5},"",null,"",{"$nulls":4},"",null,"",null,"No",null,"",{"v":0,"d":"0.0000"},"",{"v":0,"d":"0.00"},{"$f":"IF(R174=\"Interior\",IF(AND(L174=\"\",E174=\"\"),\"\",IF(OR(P174>0,O174=\"Enter Watts\",P174=\"\"),P174*N174*(1-X174)/1000,O174*N174(1-X174)/1000)),IF(AND(E174=\"\",L174=\"\"),\"\",0))","v":""},"","","","","",null,null,0,{"$nulls":3},"No"]
[null,156,{"$nulls":5},"",null,"",{"$nulls":4},"",null,{"$f":"IF(J175=\"\",\"\",J175)","v":""},null,"No",null,"",{"v":0,"d":"0.0000"},"",{"v":0,"d":"0.00"},{"$f":"IF(R175=\"Interior\",IF(AND(L175=\"\",E175=\"\"),\"\",IF(OR(P175>0,O175=\"Enter Watts\",P175=\"\"),P175*N175*(1-X175)/1000,O175*N175(1-X175)/1000)),IF(AND(E175=\"\",L175=\"\"),\"\",0))","v":""},"",{"$f":"IFERROR(IF(OR(I175>0,H175=\"Enter Watts\"),I175*G175,H175*G175)-IF(OR(P175>0,O175=\"Enter Watts\"),P175*N175,O175*N175),\"\")","v":""},"",{"$f":"IF(AND(W175=\"\",Z175=\"\"),\"\",IF(OR(W175=\"\",Z175=\"\"),0,W175-Z175))","v":""},"",null,null,0,{"$nulls":3},"No"]
[null,157,{"$nulls":5},"",null,"",{"$nulls":4},"",null,"",null,"No",null,"",{"v":0,"d":"0.0000"},"",{"v":0,"d":"0.00"},{"$f":"IF(R176=\"Interior\",IF(AND(L176=\"\",E176=\"\"),\"\",IF(OR(P176>0,O176=\"Enter Watts\",P176=\"\"),P176*N176*(1-X176)/1000,O176*N176(1-X176)/1000)),IF(AND(E176=\"\",L176=\"\"),\"\",0))","v":""},"",{"$f":"IFERROR(IF(OR(I176>0,H176=\"Enter Watts\"),I176*G176,H176*G176)-IF(OR(P176>0,O176=\"Enter Watts\"),P176*N176,O176*N176),\"\")","v":""},"",{"$f":"IF(AND(W176=\"\",Z176=\"\"),\"\",IF(OR(W176=\"\",Z176=\"\"),0,W176-Z176))","v":""},"",null,null,0,{"$nulls":3},"No"]
[null,158,{"$nulls":5},"",null,"",{"$nulls":4},"",null,"",null,"No",null,"",{"v":0,"d":"0.0000"},"",{"v":0,"d":"0.00"},{"$f":"IF(R177=\"Interior\",IF(AND(L177=\"\",E177=\"\"),\"\",IF(OR(P177>0,O177=\"Enter Watts\",P177=\"\"),P177*N177*(1-X177)/1000,O177*N177(1-X177)/1000)),IF(AND(E177=\"\",L177=\"\"),\"\",0))","v":""},"","","","","",null,null,0,{"$nulls":3},"No"]
[null,159,{"$nulls":5},"",null,"",{"$nulls":4},"",null,"",null,"No",null,"",{"v":0,"d":"0.0000"},"",{"v":0,"d":"0.00"},{"$f":"IF(R178=\"Interior\",IF(AND(L178=\"\",E178=\"\"),\"\",IF(OR(P178>0,O178=\"Enter Watts\",P178=\"\"),P178*N178*(1-X178)/1000,O178*N178(1-X178)/1000)),IF(AND(E178=\"\",L178=\"\"),\"\",0))","v":""},"","","","","",null,null,0,{"$nulls":3},"No"]
[null,160,{"$nulls":5},"",null,"",{"$nulls":4},"",null,"",null,"No",null,"",{"v":0,"d":"0.0000"},"",{"v":0,"d":"0.00"},{"$f":"IF(R179=\"Interior\",IF(AND(L179=\"\",E179=\"\"),\"\",IF(OR(P179>0,O179=\"Enter Watts\",P179=\"\"),P179*N179*(1-X179)/1000,O179*N179(1-X179)/1000)),IF(AND(E179=\"\",L179=\"\"),\"\",0))","v":""},"","","","","",null,null,0,{"$nulls":3},"No",{"$nulls":6},"","",null,""]
[null,161,{"$nulls":5},"",null,"",{"$nulls":4},"",null,"",null,"No",null,"",{"v":0,"d":"0.0000"},"",{"v":0,"d":"0.00"},{"$f":"IF(R180=\"Interior\",IF(AND(L180=\"\",E180=\"\"),\"\",IF(OR(P180>0,O180=\"Enter Watts\",P180=\"\"),P180*N180*(1-X180)/1000,O180*N180(1-X180)/1000)),IF(AND(E180=\"\",L180=\"\"),\"\",0))","v":""},"","","","","",null,null,0,{"$nulls":3},"No"]
[null,162,{"$nulls":5},"",null,"",{"$nulls":4},"",null,"",null,"No",null,"",{"v":0,"d":"0.0000"},"",{"v":0,"d":"0.00"},{"$f":"IF(R181=\"Interior\",IF(AND(L181=\"\",E181=\"\"),\"\",IF(OR(P181>0,O181=\"Enter Watts\",P181=\"\"),P181*N181*(1-X181)/1000,O181*N181(1-X181)/1000)),IF(AND(E181=\"\",L181=\"\"),\"\",0))","v":""},"","","","","",null,null,0,{"$nulls":3},"No"]
[null,163,{"$nulls":5},"",null,"",{"$nulls":4},"",null,"",null,"No",null,"",{"v":0,"d":"0.0000"},"",{"v":0,"d":"0.00"},{"$f":"IF(R182=\"Interior\",IF(AND(L182=\"\",E182=\"\"),\"\",IF(OR(P182>0,O182=\"Enter Watts\",P182=\"\"),P182*N182*(1-X182)/1000,O182*N182(1-X182)/1000)),IF(AND(E182=\"\",L182=\"\"),\"\",0))","v":""},"","","","","",null,null,0,{"$nulls":3},"No"]
[null,164,{"$nulls":5},"",null,"",{"$nulls":4},"",null,"",null,"No",null,"",{"v":0,"d":"0.0000"},"",{"v":0,"d":"0.00"},{"$f":"IF(R183=\"Interior\",IF(AND(L183=\"\",E183=\"\"),\"\",IF(OR(P183>0,O183=\"Enter Watts\",P183=\"\"),P183*N183*(1-X183)/1000,O183*N183(1-X183)/1000)),IF(AND(E183=\"\",L183=\"\"),\"\",0))","v":""},"","","","","",null,null,0,{"$nulls":3},"No"]
[null,165,{"$nulls":5},"",null,"",{"$nulls":4},"",null,"",null,"No",null,"",{"v":0,"d":"0.0000"},"",{"v":0,"d":"0.00"},{"$f":"IF(R184=\"Interior\",IF(AND(L184=\"\",E184=\"\"),\"\",IF(OR(P184>0,O184=\"Enter Watts\",P184=\"\"),P184*N184*(1-X184)/1000,O184*N184(1-X184)/1000)),IF(AND(E184=\"\",L184=\"\"),\"\",0))","v":""},"","","","","",null,null,0,{"$nulls":3},"No"]
[null,166,{"$nulls":5},"",null,"",{"$nulls":4},"",null,"",null,"No",null,"",{"v":0,"d":"0.0000"},"",{"v":0,"d":"0.00"},{"$f":"IF(R185=\"Interior\",IF(AND(L185=\"\",E185=\"\"),\"\",IF(OR(P185>0,O185=\"Enter Watts\",P185=\"\"),P185*N185*(1-X185)/1000,O185*N185(1-X185)/1000)),IF(AND(E185=\"\",L185=\"\"),\"\",0))","v":""},"","","","","",null,null,0,{"$nulls":3},"No",{"$nulls":6},"","",null,""]
[null,167,{"$nulls":5},"",null,"",{"$nulls":4},"",null,"",null,"No",null,"",{"v":0,"d":"0.0000"},"",{"v":0,"d":"0.00"},{"$f":"IF(R186=\"Interior\",IF(AND(L186=\"\",E186=\"\"),\"\",IF(OR(P186>0,O186=\"Enter Watts\",P186=\"\"),P186*N186*(1-X186)/1000,O186*N186(1-X186)/1000)),IF(AND(E186=\"\",L186=\"\"),\"\",0))","v":""},"","","","","",null,null,0,{"$nulls":3},"No"]
[null,168,{"$nulls":5},"",null,"",{"$nulls":4},"",null,"",null,"No",null,"",{"v":0,"d":"0.0000"},"",{"v":0,"d":"0.00"},{"$f":"IF(R187=\"Interior\",IF(AND(L187=\"\",E187=\"\"),\"\",IF(OR(P187>0,O187=\"Enter Watts\",P187=\"\"),P187*N187*(1-X187)/1000,O187*N187(1-X187)/1000)),IF(AND(E187=\"\",L187=\"\"),\"\",0))","v":""},"","","","","",null,null,0,{"$nulls":3},"No"]
[null,169,{"$nulls":5},"",null,"",{"$nulls":4},"",null,"",null,"No",null,"",{"v":0,"d":"0.0000"},"",{"v":0,"d":"0.00"},{"$f":"IF(R188=\"Interior\",IF(AND(L188=\"\",E188=\"\"),\"\",IF(OR(P188>0,O188=\"Enter Watts\",P188=\"\"),P188*N188*(1-X188)/1000,O188*N188(1-X188)/1000)),IF(AND(E188=\"\",L188=\"\"),\"\",0))","v":""},"","","","","",null,null,0,{"$nulls":3},"No"]
[null,170,{"$nulls":5},"",null,"",{"$nulls":4},"",null,"",null,"No",null,"",{"v":0,"d":"0.0000"},"",{"v":0,"d":"0.00"},{"$f":"IF(R189=\"Interior\",IF(AND(L189=\"\",E189=\"\"),\"\",IF(OR(P189>0,O189=\"Enter Watts\",P189=\"\"),P189*N189*(1-X189)/1000,O189*N189(1-X189)/1000)),IF(AND(E189=\"\",L189=\"\"),\"\",0))","v":""},"","","","","",null,null,0,{"$nulls":3},"No"]
[null,171,{"$nulls":5},"",null,"",{"$nulls":4},"",null,"",null,"No",null,"",{"v":0,"d":"0.0000"},"",{"v":0,"d":"0.00"},{"$f":"IF(R190=\"Interior\",IF(AND(L190=\"\",E190=\"\"),\"\",IF(OR(P190>0,O190=\"Enter Watts\",P190=\"\"),P190*N190*(1-X190)/1000,O190*N190(1-X190)/1000)),IF(AND(E190=\"\",L190=\"\"),\"\",0))","v":""},"","","","","",null,null,0,{"$nulls":3},"No"]
[null,172,{"$nulls":5},"",null,"",{"$nulls":4},"",null,"",null,"No",null,"",{"v":0,"d":"0.0000"},"",{"v":0,"d":"0.00"},{"$f":"IF(R191=\"Interior\",IF(AND(L191=\"\",E191=\"\"),\"\",IF(OR(P191>0,O191=\"Enter Watts\",P191=\"\"),P191*N191*(1-X191)/1000,O191*N191(1-X191)/1000)),IF(AND(E191=\"\",L191=\"\"),\"\",0))","v":""},"","","","","",null,null,0,{"$nulls":3},"No"]
[null,173,{"$nulls":5},"",null,"",{"$nulls":4},"",null,"",null,"No",null,"",{"v":0,"d":"0.0000"},"",{"v":0,"d":"0.00"},{"$f":"IF(R192=\"Interior\",IF(AND(L192=\"\",E192=\"\"),\"\",IF(OR(P192>0,O192=\"Enter Watts\",P192=\"\"),P192*N192*(1-X192)/1000,O192*N192(1-X192)/1000)),IF(AND(E192=\"\",L192=\"\"),\"\",0))","v":""},"","","","","",null,null,0,{"$nulls":3},"No",{"$nulls":6},"","",null,""]
[null,174,{"$nulls":5},"",null,"",{"$nulls":4},"",null,"",null,"No",null,"",{"v":0,"d":"0.0000"},"",{"v":0,"d":"0.00"},{"$f":"IF(R193=\"Interior\",IF(AND(L193=\"\",E193=\"\"),\"\",IF(OR(P193>0,O193=\"Enter Watts\",P193=\"\"),P193*N193*(1-X193)/1000,O193*N193(1-X193)/1000)),IF(AND(E193=\"\",L193=\"\"),\"\",0))","v":""},"","","","","",null,null,0,{"$nulls":3},"No"]
[null,175,{"$nulls":5},"",null,"",{"$nulls":4},"",null,"",null,"No",null,"",{"v":0,"d":"0.0000"},"",{"v":0,"d":"0.00"},{"$f":"IF(R194=\"Interior\",IF(AND(L194=\"\",E194=\"\"),\"\",IF(OR(P194>0,O194=\"Enter Watts\",P194=\"\"),P194*N194*(1-X194)/1000,O194*N194(1-X194)/1000)),IF(AND(E194=\"\",L194=\"\"),\"\",0))","v":""},"","","","","",null,null,0,{"$nulls":3},"No"]
[null,176,{"$nulls":5},"",null,"",{"$nulls":4},"",null,"",null,"No",null,"",{"v":0,"d":"0.0000"},"",{"v":0,"d":"0.00"},{"$f":"IF(R195=\"Interior\",IF(AND(L195=\"\",E195=\"\"),\"\",IF(OR(P195>0,O195=\"Enter Watts\",P195=\"\"),P195*N195*(1-X195)/1000,O195*N195(1-X195)/1000)),IF(AND(E195=\"\",L195=\"\"),\"\",0))","v":""},"","","","","",null,null,0,{"$nulls":3},"No"]
[null,177,{"$nulls":5},"",null,"",{"$nulls":4},"",null,"",null,"No",null,"",{"v":0,"d":"0.0000"},"",{"v":0,"d":"0.00"},{"$f":"IF(R196=\"Interior\",IF(AND(L196=\"\",E196=\"\"),\"\",IF(OR(P196>0,O196=\"Enter Watts\",P196=\"\"),P196*N196*(1-X196)/1000,O196*N196(1-X196)/1000)),IF(AND(E196=\"\",L196=\"\"),\"\",0))","v":""},"","","","","",null,null,0,{"$nulls":3},"No"]
[null,178,{"$nulls":5},"",null,"",{"$nulls":4},"",null,"",null,"No",null,"",{"v":0,"d":"0.0000"},"",{"v":0,"d":"0.00"},{"$f":"IF(R197=\"Interior\",IF(AND(L197=\"\",E197=\"\"),\"\",IF(OR(P197>0,O197=\"Enter Watts\",P197=\"\"),P197*N197*(1-X197)/1000,O197*N197(1-X197)/1000)),IF(AND(E197=\"\",L197=\"\"),\"\",0))","v":""},"","","","","",null,null,0,{"$nulls":3},"No"]
[null,179,{"$nulls":5},"",null,"",{"$nulls":4},"",null,"",null,"No",null,"",{"v":0,"d":"0.0000"},"",{"v":0,"d":"0.00"},{"$f":"IF(R198=\"Interior\",IF(AND(L198=\"\",E198=\"\"),\"\",IF(OR(P198>0,O198=\"Enter Watts\",P198=\"\"),P198*N198*(1-X198)/1000,O198*N198(1-X198)/1000)),IF(AND(E198=\"\",L198=\"\"),\"\",0))","v":""},"","","","","",null,null,0,{"$nulls":3},"No",{"$nulls":6},"","",null,""]
[null,180,{"$nulls":5},"",null,"",{"$nulls":4},"",null,"",null,"No",null,"",{"v":0,"d":"0.0000"},"",{"v":0,"d":"0.00"},{"$f":"IF(R199=\"Interior\",IF(AND(L199=\"\",E199=\"\"),\"\",IF(OR(P199>0,O199=\"Enter Watts\",P199=\"\"),P199*N199*(1-X199)/1000,O199*N199(1-X199)/1000)),IF(AND(E199=\"\",L199=\"\"),\"\",0))","v":""},"","","","","",null,null,0,{"$nulls":3},"No"]
[null,181,{"$nulls":5},"",null,"",{"$nulls":4},"",null,"",null,"No",null,"",{"v":0,"d":"0.0000"},"",{"v":0,"d":"0.00"},{"$f":"IF(R200=\"Interior\",IF(AND(L200=\"\",E200=\"\"),\"\",IF(OR(P200>0,O200=\"Enter Watts\",P200=\"\"),P200*N200*(1-X200)/1000,O200*N200(1-X200)/1000)),IF(AND(E200=\"\",L200=\"\"),\"\",0))","v":""},"","","","","",null,null,0,{"$nulls":3},"No"]
[null,182,{"$nulls":5},"",null,"",{"$nulls":4},"",null,"",null,"No",null,"",{"v":0,"d":"0.0000"},"",{"v":0,"d":"0.00"},{"$f":"IF(R201=\"Interior\",IF(AND(L201=\"\",E201=\"\"),\"\",IF(OR(P201>0,O201=\"Enter Watts\",P201=\"\"),P201*N201*(1-X201)/1000,O201*N201(1-X201)/1000)),IF(AND(E201=\"\",L201=\"\"),\"\",0))","v":""},"","","","","",null,null,0,{"$nulls":3},"No"]
[null,183,{"$nulls":5},"",null,"",{"$nulls":4},"",null,"",null,"No",null,"",{"v":0,"d":"0.0000"},"",{"v":0,"d":"0.00"},{"$f":"IF(R202=\"Interior\",IF(AND(L202=\"\",E202=\"\"),\"\",IF(OR(P202>0,O202=\"Enter Watts\",P202=\"\"),P202*N202*(1-X202)/1000,O202*N202(1-X202)/1000)),IF(AND(E202=\"\",L202=\"\"),\"\",0))","v":""},"","","","","",null,null,0,{"$nulls":3},"No"]
[null,184,{"$nulls":5},"",null,"",{"$nulls":4},"",null,"",null,"No",null,"",{"v":0,"d":"0.0000"},"",{"v":0,"d":"0.00"},{"$f":"IF(R203=\"Interior\",IF(AND(L203=\"\",E203=\"\"),\"\",IF(OR(P203>0,O203=\"Enter Watts\",P203=\"\"),P203*N203*(1-X203)/1000,O203*N203(1-X203)/1000)),IF(AND(E203=\"\",L203=\"\"),\"\",0))","v":""},"","","","","",null,null,0,{"$nulls":3},"No"]
[null,185,{"$nulls":5},"",null,"",{"$nulls":4},"",null,"",null,"No",null,"",{"v":0,"d":"0.0000"},"",{"v":0,"d":"0.00"},{"$f":"IF(R204=\"Interior\",IF(AND(L204=\"\",E204=\"\"),\"\",IF(OR(P204>0,O204=\"Enter Watts\",P204=\"\"),P204*N204*(1-X204)/1000,O204*N204(1-X204)/1000)),IF(AND(E204=\"\",L204=\"\"),\"\",0))","v":""},"","","","","",null,null,0,{"$nulls":3},"No"]
[null,186,{"$nulls":5},"",null,"",{"$nulls":4},"",null,"",null,"No",null,"",{"v":0,"d":"0.0000"},"",{"v":0,"d":"0.00"},{"$f":"IF(R205=\"Interior\",IF(AND(L205=\"\",E205=\"\"),\"\",IF(OR(P205>0,O205=\"Enter Watts\",P205=\"\"),P205*N205*(1-X205)/1000,O205*N205(1-X205)/1000)),IF(AND(E205=\"\",L205=\"\"),\"\",0))","v":""},"","","","","",null,null,0,{"$nulls":3},"No"]
[null,187,{"$nulls":5},"",null,"",{"$nulls":4},"",null,"",null,"No",null,"",{"v":0,"d":"0.0000"},"",{"v":0,"d":"0.00"},{"$f":"IF(R206=\"Interior\",IF(AND(L206=\"\",E206=\"\"),\"\",IF(OR(P206>0,O206=\"Enter Watts\",P206=\"\"),P206*N206*(1-X206)/1000,O206*N206(1-X206)/1000)),IF(AND(E206=\"\",L206=\"\"),\"\",0))","v":""},"","","","","",null,null,0,{"$nulls":3},"No"]
[null,188,{"$nulls":5},"",null,"",{"$nulls":4},"",null,"",null,"No",null,"",{"v":0,"d":"0.0000"},"",{"v":0,"d":"0.00"},{"$f":"IF(R207=\"Interior\",IF(AND(L207=\"\",E207=\"\"),\"\",IF(OR(P207>0,O207=\"Enter Watts\",P207=\"\"),P207*N207*(1-X207)/1000,O207*N207(1-X207)/1000)),IF(AND(E207=\"\",L207=\"\"),\"\",0))","v":""},"","","","","",null,null,0,{"$nulls":3},"No"]
[null,189,{"$nulls":5},"",null,"",{"$nulls":4},"",null,"",null,"No",null,"",{"v":0,"d":"0.0000"},"",{"v":0,"d":"0.00"},{"$f":"IF(R208=\"Interior\",IF(AND(L208=\"\",E208=\"\"),\"\",IF(OR(P208>0,O208=\"Enter Watts\",P208=\"\"),P208*N208*(1-X208)/1000,O208*N208(1-X208)/1000)),IF(AND(E208=\"\",L208=\"\"),\"\",0))","v":""},"","","","","",null,null,0,{"$nulls":3},"No"]
[null,190,{"$nulls":5},"",null,"",{"$nulls":4},"",null,"",null,"No",null,"",{"v":0,"d":"0.0000"},"",{"v":0,"d":"0.00"},{"$f":"IF(R209=\"Interior\",IF(AND(L209=\"\",E209=\"\"),\"\",IF(OR(P209>0,O209=\"Enter Watts\",P209=\"\"),P209*N209*(1-X209)/1000,O209*N209(1-X209)/1000)),IF(AND(E209=\"\",L209=\"\"),\"\",0))","v":""},"","","","","",null,null,0,{"$nulls":3},"No"]
[null,191,{"$nulls":5},"",null,"",{"$nulls":4},"",null,"",null,"No",null,"",{"v":0,"d":"0.0000"},"",{"v":0,"d":"0.00"},{"$f":"IF(R210=\"Interior\",IF(AND(L210=\"\",E210=\"\"),\"\",IF(OR(P210>0,O210=\"Enter Watts\",P210=\"\"),P210*N210*(1-X210)/1000,O210*N210(1-X210)/1000)),IF(AND(E210=\"\",L210=\"\"),\"\",0))","v":""},"","","","","",null,null,0,{"$nulls":3},"No",{"$nulls":6},"","",null,""]
[null,192,{"$nulls":5},"",null,"",{"$nulls":4},"",null,"",null,"No",null,"",{"v":0,"d":"0.0000"},"",{"v":0,"d":"0.00"},{"$f":"IF(R211=\"Interior\",IF(AND(L211=\"\",E211=\"\"),\"\",IF(OR(P211>0,O211=\"Enter Watts\",P211=\"\"),P211*N211*(1-X211)/1000,O211*N211(1-X211)/1000)),IF(AND(E211=\"\",L211=\"\"),\"\",0))","v":""},"","","","","",null,null,0,{"$nulls":3},"No"]
[null,193,{"$nulls":5},{"$f":"IF(E212=\"\",\"\",VLOOKUP(E212,$AQ$1114:$AR$1541,2,FALSE))","v":""},null,{"$f":"IF(AND(E212<>\"\",G212<>\"\",$E$8=\"Default Sector Hours\"),VLOOKUP(IF(R212=\"Exterior\",\"Exterior\",$E$7),$W$1036:$X$1041,2,FALSE),\"\")","v":""},{"$nulls":4},{"$f":"IF(L212=\"\",\"\",VLOOKUP(L212,$AQ$1113:$AR$1541,2,FALSE))","v":""},null,"",null,"No",null,"",{"v":0,"d":"0.0000"},"",{"v":0,"d":"0.00"},{"$f":"IF(R212=\"Interior\",IF(AND(L212=\"\",E212=\"\"),\"\",IF(OR(P212>0,O212=\"Enter Watts\",P212=\"\"),P212*N212*(1-X212)/1000,O212*N212(1-X212)/1000)),IF(AND(E212=\"\",L212=\"\"),\"\",0))","v":""},{"$f":"IFERROR(IF(AND(L212=\"\", E212=\"\"),\"\",N212/1000*IF(OR(P212>0,O212=\"Enter Watts\"),P212,O212)*IF(R212=\"Exterior\",$X$1041,IF($E$8=\"Manual Input\",Q212,VLOOKUP($E$7,$W$1036:$Z$1040,2,FALSE)))*IF(S212=\"Yes\",IF(R212=\"Exterior\",1-$Z$1041,1-VLOOKUP($E$7,$W$1036:$Z$1040,4,FALSE)),1)),0)","v":""},"",{"$f":"IF(AND(U212=\"\",Y212=\"\"),\"\",IF(OR(U212=\"\",Y212=\"\"),0,  IF($E$8=\"Manual Input\",$G$9,   VLOOKUP($E$7,$W$1036:$Z$1041,3,FALSE))     *(U212-Y212)))","v":""},"",{"$f":"IF(AC212=\"\",\"\",IF(AND(R212=\"Interior\",S212=\"No\",OR(T212=\"\",T212=\"No\")),$J$1027,IF(AND(R212=\"Interior\",S212=\"Yes\"),$J$1028,IF(AND(R212=\"Exterior\",S212=\"Yes\"),$J$1029,IF(AND(R212=\"Exterior\",S212=\"No\",N212<>G212),\"DNQ\",\"See Lighting Catalog to determine Code\")))))","v":""},null,null,0,{"$nulls":3},"No"]
[null,194,{"$nulls":5},"",null,"",{"$nulls":4},"",null,"",null,"No",null,{"$f":"IF(V213=\"Int Control\",IF(E213=\"\",\"\",IF(OR(I213>0,H213=\"Enter Watts\"),I213*G213/1000*(1-$E$15),H213*G213/1000*(1-$E$15))),IF(E213=\"\",\"\",IF(OR(I213>0,H213=\"Enter Watts\"),I213*G213/1000,H213*G213/1000)))","v":""},{"$f":"IF(AND(R213=\"Interior\",S213=\"Yes\"),\"Int Control\",0)","v":{"v":0,"d":"0.0000"}},{"$f":"IFERROR(IF(V213=\"Int Control\",IF(E213=\"\",\"\",G213/1000*(1-$E$15)*IF(OR(I213>0,H213=\"Enter Watts\"),I213,H213)*IF(R213=\"Exterior\",$X$1041*(1-$G$15),IF($E$8=\"Manual Input\",J213,VLOOKUP($E$7,$W$1036:$Z$1040,2,FALSE)*(1-$E$15)))),IF(E213=\"\",\"\",G213/1000*IF(OR(I213>0,H213=\"Enter Watts\"),I213,H213)*IF(R213=\"Exterior\",$X$1041,IF($E$8=\"Manual Input\",J213,VLOOKUP($E$7,$W$1036:$Z$1040,2,FALSE))))),\"0\")","v":""},{"$f":"IF(S213=\"No\",0,AA$1036)","v":{"v":0,"d":"0.00"}},{"$f":"IF(R213=\"Interior\",IF(AND(L213=\"\",E213=\"\"),\"\",IF(OR(P213>0,O213=\"Enter Watts\",P213=\"\"),P213*N213*(1-X213)/1000,O213*N213(1-X213)/1000)),IF(AND(E213=\"\",L213=\"\"),\"\",0))","v":""},"","","","","",null,null,{"$f":"AF213*N213","v":0},{"$nulls":3},{"$f":"IF(_xlfn.ISFORMULA(J213)=TRUE,\"No\",\"Yes\")","v":"No"}]
[null,195,{"$nulls":5},"",null,"",{"$nulls":4},"",null,"",null,"No",null,"",{"v":0,"d":"0.0000"},"",{"v":0,"d":"0.00"},{"$f":"IF(R214=\"Interior\",IF(AND(L214=\"\",E214=\"\"),\"\",IF(OR(P214>0,O214=\"Enter Watts\",P214=\"\"),P214*N214*(1-X214)/1000,O214*N214(1-X214)/1000)),IF(AND(E214=\"\",L214=\"\"),\"\",0))","v":""},"","","","","",null,null,0,{"$nulls":3},"No"]
[null,196,{"$nulls":5},"",null,"",{"$nulls":4},"",null,"",null,"No",null,"",{"v":0,"d":"0.0000"},"",{"v":0,"d":"0.00"},{"$f":"IF(R215=\"Interior\",IF(AND(L215=\"\",E215=\"\"),\"\",IF(OR(P215>0,O215=\"Enter Watts\",P215=\"\"),P215*N215*(1-X215)/1000,O215*N215(1-X215)/1000)),IF(AND(E215=\"\",L215=\"\"),\"\",0))","v":""},"","","","","",null,null,0,{"$nulls":3},"No"]
[null,197,{"$nulls":5},"",null,"",{"$nulls":4},"",null,"",null,"No",null,"",{"v":0,"d":"0.0000"},"",{"v":0,"d":"0.00"},{"$f":"IF(R216=\"Interior\",IF(AND(L216=\"\",E216=\"\"),\"\",IF(OR(P216>0,O216=\"Enter Watts\",P216=\"\"),P216*N216*(1-X216)/1000,O216*N216(1-X216)/1000)),IF(AND(E216=\"\",L216=\"\"),\"\",0))","v":""},"","","","","",null,null,0,{"$nulls":3},"No",{"$nulls":6},"","",null,""]
[null,198,{"$nulls":5},"",null,"",{"$nulls":4},"",null,"",null,"No",null,"",{"v":0,"d":"0.0000"},"",{"v":0,"d":"0.00"},{"$f":"IF(R217=\"Interior\",IF(AND(L217=\"\",E217=\"\"),\"\",IF(OR(P217>0,O217=\"Enter Watts\",P217=\"\"),P217*N217*(1-X217)/1000,O217*N217(1-X217)/1000)),IF(AND(E217=\"\",L217=\"\"),\"\",0))","v":""},"","","","","",null,null,0,{"$nulls":3},"No"]
[null,199,{"$nulls":5},"",null,"",{"$nulls":4},"",null,"",null,"No",null,"",{"v":0,"d":"0.0000"},"",{"v":0,"d":"0.00"},{"$f":"IF(R218=\"Interior\",IF(AND(L218=\"\",E218=\"\"),\"\",IF(OR(P218>0,O218=\"Enter Watts\",P218=\"\"),P218*N218*(1-X218)/1000,O218*N218(1-X218)/1000)),IF(AND(E218=\"\",L218=\"\"),\"\",0))","v":""},"","","","","",null,null,0,{"$nulls":3},"No"]
[null,200,{"$nulls":5},"",null,"",{"$nulls":4},"",null,"",null,"No",null,"",{"v":0,"d":"0.0000"},"",{"v":0,"d":"0.00"},{"$f":"IF(R219=\"Interior\",IF(AND(L219=\"\",E219=\"\"),\"\",IF(OR(P219>0,O219=\"Enter Watts\",P219=\"\"),P219*N219*(1-X219)/1000,O219*N219(1-X219)/1000)),IF(AND(E219=\"\",L219=\"\"),\"\",0))","v":""},"","","","","",null,null,0,{"$nulls":3},"No"]
[null,201,{"$nulls":5},"",null,"",{"$nulls":4},"",null,"",null,"No",null,"",{"v":0,"d":"0.0000"},"",{"v":0,"d":"0.00"},{"$f":"IF(R220=\"Interior\",IF(AND(L220=\"\",E220=\"\"),\"\",IF(OR(P220>0,O220=\"Enter Watts\",P220=\"\"),P220*N220*(1-X220)/1000,O220*N220(1-X220)/1000)),IF(AND(E220=\"\",L220=\"\"),\"\",0))","v":""},"","","","","",null,null,0,{"$nulls":3},"No"]
[null,202,{"$nulls":5},"",null,"",{"$nulls":4},"",null,"",null,"No",null,"",{"v":0,"d":"0.0000"},"",{"v":0,"d":"0.00"},{"$f":"IF(R221=\"Interior\",IF(AND(L221=\"\",E221=\"\"),\"\",IF(OR(P221>0,O221=\"Enter Watts\",P221=\"\"),P221*N221*(1-X221)/1000,O221*N221(1-X221)/1000)),IF(AND(E221=\"\",L221=\"\"),\"\",0))","v":""},"","","","","",null,null,0,{"$nulls":3},"No"]
[null,203,{"$nulls":5},"",null,"",{"$nulls":4},"",null,"",null,"No",null,"",{"v":0,"d":"0.0000"},"",{"v":0,"d":"0.00"},{"$f":"IF(R222=\"Interior\",IF(AND(L222=\"\",E222=\"\"),\"\",IF(OR(P222>0,O222=\"Enter Watts\",P222=\"\"),P222*N222*(1-X222)/1000,O222*N222(1-X222)/1000)),IF(AND(E222=\"\",L222=\"\"),\"\",0))","v":""},"","","","","",null,null,0,{"$nulls":3},"No"]
[null,204,{"$nulls":5},"",null,"",{"$nulls":4},"",null,{"$f":"IF(J223=\"\",\"\",J223)","v":""},null,"No",null,"",{"v":0,"d":"0.0000"},"",{"v":0,"d":"0.00"},{"$f":"IF(R223=\"Interior\",IF(AND(L223=\"\",E223=\"\"),\"\",IF(OR(P223>0,O223=\"Enter Watts\",P223=\"\"),P223*N223*(1-X223)/1000,O223*N223(1-X223)/1000)),IF(AND(E223=\"\",L223=\"\"),\"\",0))","v":""},"",{"$f":"IFERROR(IF(OR(I223>0,H223=\"Enter Watts\"),I223*G223,H223*G223)-IF(OR(P223>0,O223=\"Enter Watts\"),P223*N223,O223*N223),\"\")","v":""},"",{"$f":"IF(AND(W223=\"\",Z223=\"\"),\"\",IF(OR(W223=\"\",Z223=\"\"),0,W223-Z223))","v":""},"",null,null,0,{"$nulls":3},"No"]
[null,205,{"$nulls":5},"",null,"",{"$nulls":4},"",null,"",null,"No",null,"",{"v":0,"d":"0.0000"},"",{"v":0,"d":"0.00"},{"$f":"IF(R224=\"Interior\",IF(AND(L224=\"\",E224=\"\"),\"\",IF(OR(P224>0,O224=\"Enter Watts\",P224=\"\"),P224*N224*(1-X224)/1000,O224*N224(1-X224)/1000)),IF(AND(E224=\"\",L224=\"\"),\"\",0))","v":""},"",{"$f":"IFERROR(IF(OR(I224>0,H224=\"Enter Watts\"),I224*G224,H224*G224)-IF(OR(P224>0,O224=\"Enter Watts\"),P224*N224,O224*N224),\"\")","v":""},"",{"$f":"IF(AND(W224=\"\",Z224=\"\"),\"\",IF(OR(W224=\"\",Z224=\"\"),0,W224-Z224))","v":""},"",null,null,0,{"$nulls":3},"No"]
[null,206,{"$nulls":5},"",null,"",{"$nulls":4},"",null,"",null,"No",null,"",{"v":0,"d":"0.0000"},"",{"v":0,"d":"0.00"},{"$f":"IF(R225=\"Interior\",IF(AND(L225=\"\",E225=\"\"),\"\",IF(OR(P225>0,O225=\"Enter Watts\",P225=\"\"),P225*N225*(1-X225)/1000,O225*N225(1-X225)/1000)),IF(AND(E225=\"\",L225=\"\"),\"\",0))","v":""},"","","","","",null,null,0,{"$nulls":3},"No"]
[null,207,{"$nulls":5},"",null,"",{"$nulls":4},"",null,"",null,"No",null,"",{"v":0,"d":"0.0000"},"",{"v":0,"d":"0.00"},{"$f":"IF(R226=\"Interior\",IF(AND(L226=\"\",E226=\"\"),\"\",IF(OR(P226>0,O226=\"Enter Watts\",P226=\"\"),P226*N226*(1-X226)/1000,O226*N226(1-X226)/1000)),IF(AND(E226=\"\",L226=\"\"),\"\",0))","v":""},"","","","","",null,null,0,{"$nulls":3},"No"]
[null,208,{"$nulls":5},"",null,"",{"$nulls":4},"",null,"",null,"No",null,"",{"v":0,"d":"0.0000"},"",{"v":0,"d":"0.00"},{"$f":"IF(R227=\"Interior\",IF(AND(L227=\"\",E227=\"\"),\"\",IF(OR(P227>0,O227=\"Enter Watts\",P227=\"\"),P227*N227*(1-X227)/1000,O227*N227(1-X227)/1000)),IF(AND(E227=\"\",L227=\"\"),\"\",0))","v":""},"","","","","",null,null,0,{"$nulls":3},"No",{"$nulls":6},"","",null,""]
[null,209,{"$nulls":5},"",null,"",{"$nulls":4},"",null,"",null,"No",null,"",{"v":0,"d":"0.0000"},"",{"v":0,"d":"0.00"},{"$f":"IF(R228=\"Interior\",IF(AND(L228=\"\",E228=\"\"),\"\",IF(OR(P228>0,O228=\"Enter Watts\",P228=\"\"),P228*N228*(1-X228)/1000,O228*N228(1-X228)/1000)),IF(AND(E228=\"\",L228=\"\"),\"\",0))","v":""},"","","","","",null,null,0,{"$nulls":3},"No"]
[null,210,{"$nulls":5},"",null,"",{"$nulls":4},"",null,"",null,"No",null,"",{"v":0,"d":"0.0000"},"",{"v":0,"d":"0.00"},{"$f":"IF(R229=\"Interior\",IF(AND(L229=\"\",E229=\"\"),\"\",IF(OR(P229>0,O229=\"Enter Watts\",P229=\"\"),P229*N229*(1-X229)/1000,O229*N229(1-X229)/1000)),IF(AND(E229=\"\",L229=\"\"),\"\",0))","v":""},"","","","","",null,null,0,{"$nulls":3},"No"]
[null,211,{"$nulls":5},"",null,"",{"$nulls":4},"",null,"",null,"No",null,"",{"v":0,"d":"0.0000"},"",{"v":0,"d":"0.00"},{"$f":"IF(R230=\"Interior\",IF(AND(L230=\"\",E230=\"\"),\"\",IF(OR(P230>0,O230=\"Enter Watts\",P230=\"\"),P230*N230*(1-X230)/1000,O230*N230(1-X230)/1000)),IF(AND(E230=\"\",L230=\"\"),\"\",0))","v":""},"","","","","",null,null,0,{"$nulls":3},"No"]
[null,212,{"$nulls":5},"",null,"",{"$nulls":4},"",null,"",null,"No",null,"",{"v":0,"d":"0.0000"},"",{"v":0,"d":"0.00"},{"$f":"IF(R231=\"Interior\",IF(AND(L231=\"\",E231=\"\"),\"\",IF(OR(P231>0,O231=\"Enter Watts\",P231=\"\"),P231*N231*(1-X231)/1000,O231*N231(1-X231)/1000)),IF(AND(E231=\"\",L231=\"\"),\"\",0))","v":""},"","","","","",null,null,0,{"$nulls":3},"No"]
[null,213,{"$nulls":5},"",null,"",{"$nulls":4},"",null,"",null,"No",null,"",{"v":0,"d":"0.0000"},"",{"v":0,"d":"0.00"},{"$f":"IF(R232=\"Interior\",IF(AND(L232=\"\",E232=\"\"),\"\",IF(OR(P232>0,O232=\"Enter Watts\",P232=\"\"),P232*N232*(1-X232)/1000,O232*N232(1-X232)/1000)),IF(AND(E232=\"\",L232=\"\"),\"\",0))","v":""},"","","","","",null,null,0,{"$nulls":3},"No"]
[null,214,{"$nulls":5},"",null,"",{"$nulls":4},"",null,"",null,"No",null,"",{"v":0,"d":"0.0000"},"",{"v":0,"d":"0.00"},{"$f":"IF(R233=\"Interior\",IF(AND(L233=\"\",E233=\"\"),\"\",IF(OR(P233>0,O233=\"Enter Watts\",P233=\"\"),P233*N233*(1-X233)/1000,O233*N233(1-X233)/1000)),IF(AND(E233=\"\",L233=\"\"),\"\",0))","v":""},"","","","","",null,null,0,{"$nulls":3},"No",{"$nulls":6},"","",null,""]
[null,215,{"$nulls":5},"",null,"",{"$nulls":4},"",null,"",null,"No",null,"",{"v":0,"d":"0.0000"},"",{"v":0,"d":"0.00"},{"$f":"IF(R234=\"Interior\",IF(AND(L234=\"\",E234=\"\"),\"\",IF(OR(P234>0,O234=\"Enter Watts\",P234=\"\"),P234*N234*(1-X234)/1000,O234*N234(1-X234)/1000)),IF(AND(E234=\"\",L234=\"\"),\"\",0))","v":""},"","","","","",null,null,0,{"$nulls":3},"No"]
[null,216,{"$nulls":5},"",null,"",{"$nulls":4},"",null,"",null,"No",null,"",{"v":0,"d":"0.0000"},"",{"v":0,"d":"0.00"},{"$f":"IF(R235=\"Interior\",IF(AND(L235=\"\",E235=\"\"),\"\",IF(OR(P235>0,O235=\"Enter Watts\",P235=\"\"),P235*N235*(1-X235)/1000,O235*N235(1-X235)/1000)),IF(AND(E235=\"\",L235=\"\"),\"\",0))","v":""},"","","","","",null,null,0,{"$nulls":3},"No"]
[null,217,{"$nulls":5},"",null,"",{"$nulls":4},"",null,"",null,"No",null,"",{"v":0,"d":"0.0000"},"",{"v":0,"d":"0.00"},{"$f":"IF(R236=\"Interior\",IF(AND(L236=\"\",E236=\"\"),\"\",IF(OR(P236>0,O236=\"Enter Watts\",P236=\"\"),P236*N236*(1-X236)/1000,O236*N236(1-X236)/1000)),IF(AND(E236=\"\",L236=\"\"),\"\",0))","v":""},"","","","","",null,null,0,{"$nulls":3},"No"]
[null,218,{"$nulls":5},"",null,"",{"$nulls":4},"",null,"",null,"No",null,"",{"v":0,"d":"0.0000"},"",{"v":0,"d":"0.00"},{"$f":"IF(R237=\"Interior\",IF(AND(L237=\"\",E237=\"\"),\"\",IF(OR(P237>0,O237=\"Enter Watts\",P237=\"\"),P237*N237*(1-X237)/1000,O237*N237(1-X237)/1000)),IF(AND(E237=\"\",L237=\"\"),\"\",0))","v":""},"","","","","",null,null,0,{"$nulls":3},"No"]
[null,219,{"$nulls":5},"",null,"",{"$nulls":4},"",null,"",null,"No",null,"",{"v":0,"d":"0.0000"},"",{"v":0,"d":"0.00"},{"$f":"IF(R238=\"Interior\",IF(AND(L238=\"\",E238=\"\"),\"\",IF(OR(P238>0,O238=\"Enter Watts\",P238=\"\"),P238*N238*(1-X238)/1000,O238*N238(1-X238)/1000)),IF(AND(E238=\"\",L238=\"\"),\"\",0))","v":""},"","","","","",null,null,0,{"$nulls":3},"No"]
[null,220,{"$nulls":5},"",null,"",{"$nulls":4},"",null,"",null,"No",null,"",{"v":0,"d":"0.0000"},"",{"v":0,"d":"0.00"},{"$f":"IF(R239=\"Interior\",IF(AND(L239=\"\",E239=\"\"),\"\",IF(OR(P239>0,O239=\"Enter Watts\",P239=\"\"),P239*N239*(1-X239)/1000,O239*N239(1-X239)/1000)),IF(AND(E239=\"\",L239=\"\"),\"\",0))","v":""},"","","","","",null,null,0,{"$nulls":3},"No"]
[null,221,{"$nulls":5},"",null,"",{"$nulls":4},"",null,"",null,"No",null,"",{"v":0,"d":"0.0000"},"",{"v":0,"d":"0.00"},{"$f":"IF(R240=\"Interior\",IF(AND(L240=\"\",E240=\"\"),\"\",IF(OR(P240>0,O240=\"Enter Watts\",P240=\"\"),P240*N240*(1-X240)/1000,O240*N240(1-X240)/1000)),IF(AND(E240=\"\",L240=\"\"),\"\",0))","v":""},"","","","","",null,null,0,{"$nulls":3},"No",{"$nulls":6},"","",null,""]
[null,222,{"$nulls":5},"",null,"",{"$nulls":4},"",null,"",null,"No",null,"",{"v":0,"d":"0.0000"},"",{"v":0,"d":"0.00"},{"$f":"IF(R241=\"Interior\",IF(AND(L241=\"\",E241=\"\"),\"\",IF(OR(P241>0,O241=\"Enter Watts\",P241=\"\"),P241*N241*(1-X241)/1000,O241*N241(1-X241)/1000)),IF(AND(E241=\"\",L241=\"\"),\"\",0))","v":""},"","","","","",null,null,0,{"$nulls":3},"No"]
[null,223,{"$nulls":5},"",null,"",{"$nulls":4},"",null,"",null,"No",null,"",{"v":0,"d":"0.0000"},"",{"v":0,"d":"0.00"},{"$f":"IF(R242=\"Interior\",IF(AND(L242=\"\",E242=\"\"),\"\",IF(OR(P242>0,O242=\"Enter Watts\",P242=\"\"),P242*N242*(1-X242)/1000,O242*N242(1-X242)/1000)),IF(AND(E242=\"\",L242=\"\"),\"\",0))","v":""},"","","","","",null,null,0,{"$nulls":3},"No"]
[null,224,{"$nulls":5},"",null,"",{"$nulls":4},"",null,"",null,"No",null,"",{"v":0,"d":"0.0000"},"",{"v":0,"d":"0.00"},{"$f":"IF(R243=\"Interior\",IF(AND(L243=\"\",E243=\"\"),\"\",IF(OR(P243>0,O243=\"Enter Watts\",P243=\"\"),P243*N243*(1-X243)/1000,O243*N243(1-X243)/1000)),IF(AND(E243=\"\",L243=\"\"),\"\",0))","v":""},"","","","","",null,null,0,{"$nulls":3},"No"]
[null,225,{"$nulls":5},"",null,"",{"$nulls":4},"",null,"",null,"No",null,"",{"v":0,"d":"0.0000"},"",{"v":0,"d":"0.00"},{"$f":"IF(R244=\"Interior\",IF(AND(L244=\"\",E244=\"\"),\"\",IF(OR(P244>0,O244=\"Enter Watts\",P244=\"\"),P244*N244*(1-X244)/1000,O244*N244(1-X244)/1000)),IF(AND(E244=\"\",L244=\"\"),\"\",0))","v":""},"","","","","",null,null,0,{"$nulls":3},"No"]
[null,226,{"$nulls":5},"",null,"",{"$nulls":4},"",null,"",null,"No",null,"",{"v":0,"d":"0.0000"},"",{"v":0,"d":"0.00"},{"$f":"IF(R245=\"Interior\",IF(AND(L245=\"\",E245=\"\"),\"\",IF(OR(P245>0,O245=\"Enter Watts\",P245=\"\"),P245*N245*(1-X245)/1000,O245*N245(1-X245)/1000)),IF(AND(E245=\"\",L245=\"\"),\"\",0))","v":""},"","","","","",null,null,0,{"$nulls":3},"No"]
[null,227,{"$nulls":5},"",null,"",{"$nulls":4},"",null,"",null,"No",null,"",{"v":0,"d":"0.0000"},"",{"v":0,"d":"0.00"},{"$f":"IF(R246=\"Interior\",IF(AND(L246=\"\",E246=\"\"),\"\",IF(OR(P246>0,O246=\"Enter Watts\",P246=\"\"),P246*N246*(1-X246)/1000,O246*N246(1-X246)/1000)),IF(AND(E246=\"\",L246=\"\"),\"\",0))","v":""},"","","","","",null,null,0,{"$nulls":3},"No",{"$nulls":6},"","",null,""]
[null,228,{"$nulls":5},"",null,"",{"$nulls":4},"",null,"",null,"No",null,"",{"v":0,"d":"0.0000"},"",{"v":0,"d":"0.00"},{"$f":"IF(R247=\"Interior\",IF(AND(L247=\"\",E247=\"\"),\"\",IF(OR(P247>0,O247=\"Enter Watts\",P247=\"\"),P247*N247*(1-X247)/1000,O247*N247(1-X247)/1000)),IF(AND(E247=\"\",L247=\"\"),\"\",0))","v":""},"","","","","",null,null,0,{"$nulls":3},"No"]
[null,229,{"$nulls":5},"",null,"",{"$nulls":4},"",null,"",null,"No",null,"",{"v":0,"d":"0.0000"},"",{"v":0,"d":"0.00"},{"$f":"IF(R248=\"Interior\",IF(AND(L248=\"\",E248=\"\"),\"\",IF(OR(P248>0,O248=\"Enter Watts\",P248=\"\"),P248*N248*(1-X248)/1000,O248*N248(1-X248)/1000)),IF(AND(E248=\"\",L248=\"\"),\"\",0))","v":""},"","","","","",null,null,0,{"$nulls":3},"No"]
[null,230,{"$nulls":5},"",null,"",{"$nulls":4},"",null,"",null,"No",null,"",{"v":0,"d":"0.0000"},"",{"v":0,"d":"0.00"},{"$f":"IF(R249=\"Interior\",IF(AND(L249=\"\",E249=\"\"),\"\",IF(OR(P249>0,O249=\"Enter Watts\",P249=\"\"),P249*N249*(1-X249)/1000,O249*N249(1-X249)/1000)),IF(AND(E249=\"\",L249=\"\"),\"\",0))","v":""},"","","","","",null,null,0,{"$nulls":3},"No"]
[null,231,{"$nulls":5},"",null,"",{"$nulls":4},"",null,"",null,"No",null,"",{"v":0,"d":"0.0000"},"",{"v":0,"d":"0.00"},{"$f":"IF(R250=\"Interior\",IF(AND(L250=\"\",E250=\"\"),\"\",IF(OR(P250>0,O250=\"Enter Watts\",P250=\"\"),P250*N250*(1-X250)/1000,O250*N250(1-X250)/1000)),IF(AND(E250=\"\",L250=\"\"),\"\",0))","v":""},"","","","","",null,null,0,{"$nulls":3},"No"]
[null,232,{"$nulls":5},"",null,"",{"$nulls":4},"",null,"",null,"No",null,"",{"v":0,"d":"0.0000"},"",{"v":0,"d":"0.00"},{"$f":"IF(R251=\"Interior\",IF(AND(L251=\"\",E251=\"\"),\"\",IF(OR(P251>0,O251=\"Enter Watts\",P251=\"\"),P251*N251*(1-X251)/1000,O251*N251(1-X251)/1000)),IF(AND(E251=\"\",L251=\"\"),\"\",0))","v":""},"","","","","",null,null,0,{"$nulls":3},"No"]
[null,233,{"$nulls":5},"",null,"",{"$nulls":4},"",null,"",null,"No",null,"",{"v":0,"d":"0.0000"},"",{"v":0,"d":"0.00"},{"$f":"IF(R252=\"Interior\",IF(AND(L252=\"\",E252=\"\"),\"\",IF(OR(P252>0,O252=\"Enter Watts\",P252=\"\"),P252*N252*(1-X252)/1000,O252*N252(1-X252)/1000)),IF(AND(E252=\"\",L252=\"\"),\"\",0))","v":""},"","","","","",null,null,0,{"$nulls":3},"No"]
[null,234,{"$nulls":5},"",null,"",{"$nulls":4},"",null,"",null,"No",null,"",{"v":0,"d":"0.0000"},"",{"v":0,"d":"0.00"},{"$f":"IF(R253=\"Interior\",IF(AND(L253=\"\",E253=\"\"),\"\",IF(OR(P253>0,O253=\"Enter Watts\",P253=\"\"),P253*N253*(1-X253)/1000,O253*N253(1-X253)/1000)),IF(AND(E253=\"\",L253=\"\"),\"\",0))","v":""},"","","","","",null,null,0,{"$nulls":3},"No"]
[null,235,{"$nulls":5},"",null,"",{"$nulls":4},"",null,"",null,"No",null,"",{"v":0,"d":"0.0000"},"",{"v":0,"d":"0.00"},{"$f":"IF(R254=\"Interior\",IF(AND(L254=\"\",E254=\"\"),\"\",IF(OR(P254>0,O254=\"Enter Watts\",P254=\"\"),P254*N254*(1-X254)/1000,O254*N254(1-X254)/1000)),IF(AND(E254=\"\",L254=\"\"),\"\",0))","v":""},"","","","","",null,null,0,{"$nulls":3},"No"]
[null,236,{"$nulls":5},"",null,"",{"$nulls":4},"",null,"",null,"No",null,"",{"v":0,"d":"0.0000"},"",{"v":0,"d":"0.00"},{"$f":"IF(R255=\"Interior\",IF(AND(L255=\"\",E255=\"\"),\"\",IF(OR(P255>0,O255=\"Enter Watts\",P255=\"\"),P255*N255*(1-X255)/1000,O255*N255(1-X255)/1000)),IF(AND(E255=\"\",L255=\"\"),\"\",0))","v":""},"","","","","",null,null,0,{"$nulls":3},"No"]
[null,237,{"$nulls":5},"",null,"",{"$nulls":4},"",null,"",null,"No",null,"",{"v":0,"d":"0.0000"},"",{"v":0,"d":"0.00"},{"$f":"IF(R256=\"Interior\",IF(AND(L256=\"\",E256=\"\"),\"\",IF(OR(P256>0,O256=\"Enter Watts\",P256=\"\"),P256*N256*(1-X256)/1000,O256*N256(1-X256)/1000)),IF(AND(E256=\"\",L256=\"\"),\"\",0))","v":""},"","","","","",null,null,0,{"$nulls":3},"No"]
[null,238,{"$nulls":5},"",null,"",{"$nulls":4},"",null,"",null,"No",null,"",{"v":0,"d":"0.0000"},"",{"v":0,"d":"0.00"},{"$f":"IF(R257=\"Interior\",IF(AND(L257=\"\",E257=\"\"),\"\",IF(OR(P257>0,O257=\"Enter Watts\",P257=\"\"),P257*N257*(1-X257)/1000,O257*N257(1-X257)/1000)),IF(AND(E257=\"\",L257=\"\"),\"\",0))","v":""},"","","","","",null,null,0,{"$nulls":3},"No"]
[null,239,{"$nulls":5},"",null,"",{"$nulls":4},"",null,"",null,"No",null,"",{"v":0,"d":"0.0000"},"",{"v":0,"d":"0.00"},{"$f":"IF(R258=\"Interior\",IF(AND(L258=\"\",E258=\"\"),\"\",IF(OR(P258>0,O258=\"Enter Watts\",P258=\"\"),P258*N258*(1-X258)/1000,O258*N258(1-X258)/1000)),IF(AND(E258=\"\",L258=\"\"),\"\",0))","v":""},"","","","","",null,null,0,{"$nulls":3},"No",{"$nulls":6},"","",null,""]
[null,240,{"$nulls":5},"",null,"",{"$nulls":4},"",null,"",null,"No",null,"",{"v":0,"d":"0.0000"},"",{"v":0,"d":"0.00"},{"$f":"IF(R259=\"Interior\",IF(AND(L259=\"\",E259=\"\"),\"\",IF(OR(P259>0,O259=\"Enter Watts\",P259=\"\"),P259*N259*(1-X259)/1000,O259*N259(1-X259)/1000)),IF(AND(E259=\"\",L259=\"\"),\"\",0))","v":""},"","","","","",null,null,0,{"$nulls":3},"No"]
[null,241,{"$nulls":5},"",null,"",{"$nulls":4},"",null,"",null,"No",null,"",{"v":0,"d":"0.0000"},"",{"v":0,"d":"0.00"},{"$f":"IF(R260=\"Interior\",IF(AND(L260=\"\",E260=\"\"),\"\",IF(OR(P260>0,O260=\"Enter Watts\",P260=\"\"),P260*N260*(1-X260)/1000,O260*N260(1-X260)/1000)),IF(AND(E260=\"\",L260=\"\"),\"\",0))","v":""},"","","","","",null,null,0,{"$nulls":3},"No"]
[null,242,{"$nulls":5},"",null,"",{"$nulls":4},"",null,"",null,"No",null,"",{"v":0,"d":"0.0000"},"",{"v":0,"d":"0.00"},{"$f":"IF(R261=\"Interior\",IF(AND(L261=\"\",E261=\"\"),\"\",IF(OR(P261>0,O261=\"Enter Watts\",P261=\"\"),P261*N261*(1-X261)/1000,O261*N261(1-X261)/1000)),IF(AND(E261=\"\",L261=\"\"),\"\",0))","v":""},"","","","","",null,null,0,{"$nulls":3},"No"]
[null,243,{"$nulls":5},"",null,"",{"$nulls":4},"",null,"",null,"No",null,"",{"v":0,"d":"0.0000"},"",{"v":0,"d":"0.00"},{"$f":"IF(R262=\"Interior\",IF(AND(L262=\"\",E262=\"\"),\"\",IF(OR(P262>0,O262=\"Enter Watts\",P262=\"\"),P262*N262*(1-X262)/1000,O262*N262(1-X262)/1000)),IF(AND(E262=\"\",L262=\"\"),\"\",0))","v":""},"","","","","",null,null,0,{"$nulls":3},"No"]
[null,244,{"$nulls":5},"",null,"",{"$nulls":4},"",null,"",null,"No",null,"",{"v":0,"d":"0.0000"},"",{"v":0,"d":"0.00"},{"$f":"IF(R263=\"Interior\",IF(AND(L263=\"\",E263=\"\"),\"\",IF(OR(P263>0,O263=\"Enter Watts\",P263=\"\"),P263*N263*(1-X263)/1000,O263*N263(1-X263)/1000)),IF(AND(E263=\"\",L263=\"\"),\"\",0))","v":""},"","","","","",null,null,0,{"$nulls":3},"No"]
[null,245,{"$nulls":5},"",null,"",{"$nulls":4},"",null,"",null,"No",null,"",{"v":0,"d":"0.0000"},"",{"v":0,"d":"0.00"},{"$f":"IF(R264=\"Interior\",IF(AND(L264=\"\",E264=\"\"),\"\",IF(OR(P264>0,O264=\"Enter Watts\",P264=\"\"),P264*N264*(1-X264)/1000,O264*N264(1-X264)/1000)),IF(AND(E264=\"\",L264=\"\"),\"\",0))","v":""},"","","","","",null,null,0,{"$nulls":3},"No",{"$nulls":6},"","",null,""]
[null,246,{"$nulls":5},"",null,"",{"$nulls":4},"",null,"",null,"No",null,"",{"v":0,"d":"0.0000"},"",{"v":0,"d":"0.00"},{"$f":"IF(R265=\"Interior\",IF(AND(L265=\"\",E265=\"\"),\"\",IF(OR(P265>0,O265=\"Enter Watts\",P265=\"\"),P265*N265*(1-X265)/1000,O265*N265(1-X265)/1000)),IF(AND(E265=\"\",L265=\"\"),\"\",0))","v":""},"","","","","",null,null,0,{"$nulls":3},"No"]
[null,247,{"$nulls":5},"",null,"",{"$nulls":4},"",null,"",null,"No",null,"",{"v":0,"d":"0.0000"},"",{"v":0,"d":"0.00"},{"$f":"IF(R266=\"Interior\",IF(AND(L266=\"\",E266=\"\"),\"\",IF(OR(P266>0,O266=\"Enter Watts\",P266=\"\"),P266*N266*(1-X266)/1000,O266*N266(1-X266)/1000)),IF(AND(E266=\"\",L266=\"\"),\"\",0))","v":""},"","","","","",null,null,0,{"$nulls":3},"No"]
[null,248,{"$nulls":5},"",null,"",{"$nulls":4},"",null,"",null,"No",null,"",{"v":0,"d":"0.0000"},"",{"v":0,"d":"0.00"},{"$f":"IF(R267=\"Interior\",IF(AND(L267=\"\",E267=\"\"),\"\",IF(OR(P267>0,O267=\"Enter Watts\",P267=\"\"),P267*N267*(1-X267)/1000,O267*N267(1-X267)/1000)),IF(AND(E267=\"\",L267=\"\"),\"\",0))","v":""},"","","","","",null,null,0,{"$nulls":3},"No"]
[null,249,{"$nulls":5},"",null,"",{"$nulls":4},"",null,"",null,"No",null,"",{"v":0,"d":"0.0000"},"",{"v":0,"d":"0.00"},{"$f":"IF(R268=\"Interior\",IF(AND(L268=\"\",E268=\"\"),\"\",IF(OR(P268>0,O268=\"Enter Watts\",P268=\"\"),P268*N268*(1-X268)/1000,O268*N268(1-X268)/1000)),IF(AND(E268=\"\",L268=\"\"),\"\",0))","v":""},"","","","","",null,null,0,{"$nulls":3},"No"]
[null,250,{"$nulls":5},"",null,"",{"$nulls":4},"",null,"",null,"No",null,"",{"v":0,"d":"0.0000"},"",{"v":0,"d":"0.00"},{"$f":"IF(R269=\"Interior\",IF(AND(L269=\"\",E269=\"\"),\"\",IF(OR(P269>0,O269=\"Enter Watts\",P269=\"\"),P269*N269*(1-X269)/1000,O269*N269(1-X269)/1000)),IF(AND(E269=\"\",L269=\"\"),\"\",0))","v":""},"","","","","",null,null,0,{"$nulls":3},"No"]
[null,251,{"$nulls":5},"",null,"",{"$nulls":4},"",null,"",null,"No",null,"",{"v":0,"d":"0.0000"},"",{"v":0,"d":"0.00"},{"$f":"IF(R270=\"Interior\",IF(AND(L270=\"\",E270=\"\"),\"\",IF(OR(P270>0,O270=\"Enter Watts\",P270=\"\"),P270*N270*(1-X270)/1000,O270*N270(1-X270)/1000)),IF(AND(E270=\"\",L270=\"\"),\"\",0))","v":""},"","","","","",null,null,0,{"$nulls":3},"No"]
[null,252,{"$nulls":5},"",null,"",{"$nulls":4},"",null,"",null,"No",null,"",{"v":0,"d":"0.0000"},"",{"v":0,"d":"0.00"},{"$f":"IF(R271=\"Interior\",IF(AND(L271=\"\",E271=\"\"),\"\",IF(OR(P271>0,O271=\"Enter Watts\",P271=\"\"),P271*N271*(1-X271)/1000,O271*N271(1-X271)/1000)),IF(AND(E271=\"\",L271=\"\"),\"\",0))","v":""},"",{"$f":"IFERROR(IF(OR(I271>0,H271=\"Enter Watts\"),I271*G271,H271*G271)-IF(OR(P271>0,O271=\"Enter Watts\"),P271*N271,O271*N271),\"\")","v":""},"",{"$f":"IF(AND(W271=\"\",Z271=\"\"),\"\",IF(OR(W271=\"\",Z271=\"\"),0,W271-Z271))","v":""},"",null,null,0,{"$nulls":3},"No"]
[null,253,{"$nulls":5},"",null,"",{"$nulls":4},"",null,"",null,"No",null,"",{"v":0,"d":"0.0000"},"",{"v":0,"d":"0.00"},{"$f":"IF(R272=\"Interior\",IF(AND(L272=\"\",E272=\"\"),\"\",IF(OR(P272>0,O272=\"Enter Watts\",P272=\"\"),P272*N272*(1-X272)/1000,O272*N272(1-X272)/1000)),IF(AND(E272=\"\",L272=\"\"),\"\",0))","v":""},"",{"$f":"IFERROR(IF(OR(I272>0,H272=\"Enter Watts\"),I272*G272,H272*G272)-IF(OR(P272>0,O272=\"Enter Watts\"),P272*N272,O272*N272),\"\")","v":""},"",{"$f":"IF(AND(W272=\"\",Z272=\"\"),\"\",IF(OR(W272=\"\",Z272=\"\"),0,W272-Z272))","v":""},"",null,null,0,{"$nulls":3},"No"]
[null,254,{"$nulls":5},"",null,"",{"$nulls":4},"",null,"",null,"No",null,"",{"v":0,"d":"0.0000"},"",{"v":0,"d":"0.00"},{"$f":"IF(R273=\"Interior\",IF(AND(L273=\"\",E273=\"\"),\"\",IF(OR(P273>0,O273=\"Enter Watts\",P273=\"\"),P273*N273*(1-X273)/1000,O273*N273(1-X273)/1000)),IF(AND(E273=\"\",L273=\"\"),\"\",0))","v":""},"","","","","",null,null,0,{"$nulls":3},"No"]
[null,255,{"$nulls":5},"",null,"",{"$nulls":4},"",null,"",null,"No",null,"",{"v":0,"d":"0.0000"},"",{"v":0,"d":"0.00"},{"$f":"IF(R274=\"Interior\",IF(AND(L274=\"\",E274=\"\"),\"\",IF(OR(P274>0,O274=\"Enter Watts\",P274=\"\"),P274*N274*(1-X274)/1000,O274*N274(1-X274)/1000)),IF(AND(E274=\"\",L274=\"\"),\"\",0))","v":""},"","","","","",null,null,0,{"$nulls":3},"No"]
[null,256,{"$nulls":5},"",null,"",{"$nulls":4},"",null,"",null,"No",null,"",{"v":0,"d":"0.0000"},"",{"v":0,"d":"0.00"},{"$f":"IF(R275=\"Interior\",IF(AND(L275=\"\",E275=\"\"),\"\",IF(OR(P275>0,O275=\"Enter Watts\",P275=\"\"),P275*N275*(1-X275)/1000,O275*N275(1-X275)/1000)),IF(AND(E275=\"\",L275=\"\"),\"\",0))","v":""},"","","","","",null,null,0,{"$nulls":3},"No",{"$nulls":6},"","",null,""]
[null,257,{"$nulls":5},{"$f":"IF(E276=\"\",\"\",VLOOKUP(E276,$AQ$1114:$AR$1541,2,FALSE))","v":""},null,{"$f":"IF(AND(E276<>\"\",G276<>\"\",$E$8=\"Default Sector Hours\"),VLOOKUP(IF(R276=\"Exterior\",\"Exterior\",$E$7),$W$1036:$X$1041,2,FALSE),\"\")","v":""},{"$nulls":4},{"$f":"IF(L276=\"\",\"\",VLOOKUP(L276,$AQ$1113:$AR$1541,2,FALSE))","v":""},null,"",null,"No",null,"",{"v":0,"d":"0.0000"},"",{"v":0,"d":"0.00"},{"$f":"IF(R276=\"Interior\",IF(AND(L276=\"\",E276=\"\"),\"\",IF(OR(P276>0,O276=\"Enter Watts\",P276=\"\"),P276*N276*(1-X276)/1000,O276*N276(1-X276)/1000)),IF(AND(E276=\"\",L276=\"\"),\"\",0))","v":""},{"$f":"IFERROR(IF(AND(L276=\"\", E276=\"\"),\"\",N276/1000*IF(OR(P276>0,O276=\"Enter Watts\"),P276,O276)*IF(R276=\"Exterior\",$X$1041,IF($E$8=\"Manual Input\",Q276,VLOOKUP($E$7,$W$1036:$Z$1040,2,FALSE)))*IF(S276=\"Yes\",IF(R276=\"Exterior\",1-$Z$1041,1-VLOOKUP($E$7,$W$1036:$Z$1040,4,FALSE)),1)),0)","v":""},"",{"$f":"IF(AND(U276=\"\",Y276=\"\"),\"\",IF(OR(U276=\"\",Y276=\"\"),0,  IF($E$8=\"Manual Input\",$G$9,   VLOOKUP($E$7,$W$1036:$Z$1041,3,FALSE))     *(U276-Y276)))","v":""},"",{"$f":"IF(AC276=\"\",\"\",IF(AND(R276=\"Interior\",S276=\"No\",OR(T276=\"\",T276=\"No\")),$J$1027,IF(AND(R276=\"Interior\",S276=\"Yes\"),$J$1028,IF(AND(R276=\"Exterior\",S276=\"Yes\"),$J$1029,IF(AND(R276=\"Exterior\",S276=\"No\",N276<>G276),\"DNQ\",\"See Lighting Catalog to determine Code\")))))","v":""},null,null,0,{"$nulls":3},"No"]
[null,258,{"$nulls":5},"",null,"",{"$nulls":4},"",null,"",null,"No",null,{"$f":"IF(V277=\"Int Control\",IF(E277=\"\",\"\",IF(OR(I277>0,H277=\"Enter Watts\"),I277*G277/1000*(1-$E$15),H277*G277/1000*(1-$E$15))),IF(E277=\"\",\"\",IF(OR(I277>0,H277=\"Enter Watts\"),I277*G277/1000,H277*G277/1000)))","v":""},{"$f":"IF(AND(R277=\"Interior\",S277=\"Yes\"),\"Int Control\",0)","v":{"v":0,"d":"0.0000"}},{"$f":"IFERROR(IF(V277=\"Int Control\",IF(E277=\"\",\"\",G277/1000*(1-$E$15)*IF(OR(I277>0,H277=\"Enter Watts\"),I277,H277)*IF(R277=\"Exterior\",$X$1041*(1-$G$15),IF($E$8=\"Manual Input\",J277,VLOOKUP($E$7,$W$1036:$Z$1040,2,FALSE)*(1-$E$15)))),IF(E277=\"\",\"\",G277/1000*IF(OR(I277>0,H277=\"Enter Watts\"),I277,H277)*IF(R277=\"Exterior\",$X$1041,IF($E$8=\"Manual Input\",J277,VLOOKUP($E$7,$W$1036:$Z$1040,2,FALSE))))),\"0\")","v":""},{"$f":"IF(S277=\"No\",0,AA$1036)","v":{"v":0,"d":"0.00"}},{"$f":"IF(R277=\"Interior\",IF(AND(L277=\"\",E277=\"\"),\"\",IF(OR(P277>0,O277=\"Enter Watts\",P277=\"\"),P277*N277*(1-X277)/1000,O277*N277(1-X277)/1000)),IF(AND(E277=\"\",L277=\"\"),\"\",0))","v":""},"","","","","",null,null,{"$f":"AF277*N277","v":0},{"$nulls":3},{"$f":"IF(_xlfn.ISFORMULA(J277)=TRUE,\"No\",\"Yes\")","v":"No"}]
[null,259,{"$nulls":5},"",null,"",{"$nulls":4},"",null,"",null,"No",null,"",{"v":0,"d":"0.0000"},"",{"v":0,"d":"0.00"},{"$f":"IF(R278=\"Interior\",IF(AND(L278=\"\",E278=\"\"),\"\",IF(OR(P278>0,O278=\"Enter Watts\",P278=\"\"),P278*N278*(1-X278)/1000,O278*N278(1-X278)/1000)),IF(AND(E278=\"\",L278=\"\"),\"\",0))","v":""},"","","","","",null,null,0,{"$nulls":3},"No"]
[null,260,{"$nulls":5},"",null,"",{"$nulls":4},"",null,"",null,"No",null,"",{"v":0,"d":"0.0000"},"",{"v":0,"d":"0.00"},{"$f":"IF(R279=\"Interior\",IF(AND(L279=\"\",E279=\"\"),\"\",IF(OR(P279>0,O279=\"Enter Watts\",P279=\"\"),P279*N279*(1-X279)/1000,O279*N279(1-X279)/1000)),IF(AND(E279=\"\",L279=\"\"),\"\",0))","v":""},"","","","","",null,null,0,{"$nulls":3},"No"]
[null,261,{"$nulls":5},"",null,"",{"$nulls":4},"",null,"",null,"No",null,"",{"v":0,"d":"0.0000"},"",{"v":0,"d":"0.00"},{"$f":"IF(R280=\"Interior\",IF(AND(L280=\"\",E280=\"\"),\"\",IF(OR(P280>0,O280=\"Enter Watts\",P280=\"\"),P280*N280*(1-X280)/1000,O280*N280(1-X280)/1000)),IF(AND(E280=\"\",L280=\"\"),\"\",0))","v":""},"","","","","",null,null,0,{"$nulls":3},"No"]
[null,262,{"$nulls":5},"",null,"",{"$nulls":4},"",null,"",null,"No",null,"",{"v":0,"d":"0.0000"},"",{"v":0,"d":"0.00"},{"$f":"IF(R281=\"Interior\",IF(AND(L281=\"\",E281=\"\"),\"\",IF(OR(P281>0,O281=\"Enter Watts\",P281=\"\"),P281*N281*(1-X281)/1000,O281*N281(1-X281)/1000)),IF(AND(E281=\"\",L281=\"\"),\"\",0))","v":""},"","","","","",null,null,0,{"$nulls":3},"No",{"$nulls":6},"","",null,""]
[null,263,{"$nulls":5},"",null,"",{"$nulls":4},"",null,"",null,"No",null,"",{"v":0,"d":"0.0000"},"",{"v":0,"d":"0.00"},{"$f":"IF(R282=\"Interior\",IF(AND(L282=\"\",E282=\"\"),\"\",IF(OR(P282>0,O282=\"Enter Watts\",P282=\"\"),P282*N282*(1-X282)/1000,O282*N282(1-X282)/1000)),IF(AND(E282=\"\",L282=\"\"),\"\",0))","v":""},"","","","","",null,null,0,{"$nulls":3},"No"]
[null,264,{"$nulls":5},"",null,"",{"$nulls":4},"",null,"",null,"No",null,"",{"v":0,"d":"0.0000"},"",{"v":0,"d":"0.00"},{"$f":"IF(R283=\"Interior\",IF(AND(L283=\"\",E283=\"\"),\"\",IF(OR(P283>0,O283=\"Enter Watts\",P283=\"\"),P283*N283*(1-X283)/1000,O283*N283(1-X283)/1000)),IF(AND(E283=\"\",L283=\"\"),\"\",0))","v":""},"","","","","",null,null,0,{"$nulls":3},"No"]
[null,265,{"$nulls":5},"",null,"",{"$nulls":4},"",null,"",null,"No",null,"",{"v":0,"d":"0.0000"},"",{"v":0,"d":"0.00"},{"$f":"IF(R284=\"Interior\",IF(AND(L284=\"\",E284=\"\"),\"\",IF(OR(P284>0,O284=\"Enter Watts\",P284=\"\"),P284*N284*(1-X284)/1000,O284*N284(1-X284)/1000)),IF(AND(E284=\"\",L284=\"\"),\"\",0))","v":""},"","","","","",null,null,0,{"$nulls":3},"No"]
[null,266,{"$nulls":5},"",null,"",{"$nulls":4},"",null,"",null,"No",null,"",{"v":0,"d":"0.0000"},"",{"v":0,"d":"0.00"},{"$f":"IF(R285=\"Interior\",IF(AND(L285=\"\",E285=\"\"),\"\",IF(OR(P285>0,O285=\"Enter Watts\",P285=\"\"),P285*N285*(1-X285)/1000,O285*N285(1-X285)/1000)),IF(AND(E285=\"\",L285=\"\"),\"\",0))","v":""},"","","","","",null,null,0,{"$nulls":3},"No"]
[null,267,{"$nulls":5},"",null,"",{"$nulls":4},"",null,"",null,"No",null,"",{"v":0,"d":"0.0000"},"",{"v":0,"d":"0.00"},{"$f":"IF(R286=\"Interior\",IF(AND(L286=\"\",E286=\"\"),\"\",IF(OR(P286>0,O286=\"Enter Watts\",P286=\"\"),P286*N286*(1-X286)/1000,O286*N286(1-X286)/1000)),IF(AND(E286=\"\",L286=\"\"),\"\",0))","v":""},"","","","","",null,null,0,{"$nulls":3},"No"]
[null,268,{"$nulls":5},"",null,"",{"$nulls":4},"",null,"",null,"No",null,"",{"v":0,"d":"0.0000"},"",{"v":0,"d":"0.00"},{"$f":"IF(R287=\"Interior\",IF(AND(L287=\"\",E287=\"\"),\"\",IF(OR(P287>0,O287=\"Enter Watts\",P287=\"\"),P287*N287*(1-X287)/1000,O287*N287(1-X287)/1000)),IF(AND(E287=\"\",L287=\"\"),\"\",0))","v":""},"","","","","",null,null,0,{"$nulls":3},"No"]
[null,269,{"$nulls":5},"",null,"",{"$nulls":4},"",null,"",null,"No",null,"",{"v":0,"d":"0.0000"},"",{"v":0,"d":"0.00"},{"$f":"IF(R288=\"Interior\",IF(AND(L288=\"\",E288=\"\"),\"\",IF(OR(P288>0,O288=\"Enter Watts\",P288=\"\"),P288*N288*(1-X288)/1000,O288*N288(1-X288)/1000)),IF(AND(E288=\"\",L288=\"\"),\"\",0))","v":""},"","","","","",null,null,0,{"$nulls":3},"No",{"$nulls":6},"","",null,""]
[null,270,{"$nulls":5},"",null,"",{"$nulls":4},"",null,"",null,"No",null,"",{"v":0,"d":"0.0000"},"",{"v":0,"d":"0.00"},{"$f":"IF(R289=\"Interior\",IF(AND(L289=\"\",E289=\"\"),\"\",IF(OR(P289>0,O289=\"Enter Watts\",P289=\"\"),P289*N289*(1-X289)/1000,O289*N289(1-X289)/1000)),IF(AND(E289=\"\",L289=\"\"),\"\",0))","v":""},"","","","","",null,null,0,{"$nulls":3},"No"]
[null,271,{"$nulls":5},"",null,"",{"$nulls":4},"",null,"",null,"No",null,"",{"v":0,"d":"0.0000"},"",{"v":0,"d":"0.00"},{"$f":"IF(R290=\"Interior\",IF(AND(L290=\"\",E290=\"\"),\"\",IF(OR(P290>0,O290=\"Enter Watts\",P290=\"\"),P290*N290*(1-X290)/1000,O290*N290(1-X290)/1000)),IF(AND(E290=\"\",L290=\"\"),\"\",0))","v":""},"","","","","",null,null,0,{"$nulls":3},"No"]
[null,272,{"$nulls":5},"",null,"",{"$nulls":4},"",null,"",null,"No",null,"",{"v":0,"d":"0.0000"},"",{"v":0,"d":"0.00"},{"$f":"IF(R291=\"Interior\",IF(AND(L291=\"\",E291=\"\"),\"\",IF(OR(P291>0,O291=\"Enter Watts\",P291=\"\"),P291*N291*(1-X291)/1000,O291*N291(1-X291)/1000)),IF(AND(E291=\"\",L291=\"\"),\"\",0))","v":""},"","","","","",null,null,0,{"$nulls":3},"No"]
[null,273,{"$nulls":5},"",null,"",{"$nulls":4},"",null,"",null,"No",null,"",{"v":0,"d":"0.0000"},"",{"v":0,"d":"0.00"},{"$f":"IF(R292=\"Interior\",IF(AND(L292=\"\",E292=\"\"),\"\",IF(OR(P292>0,O292=\"Enter Watts\",P292=\"\"),P292*N292*(1-X292)/1000,O292*N292(1-X292)/1000)),IF(AND(E292=\"\",L292=\"\"),\"\",0))","v":""},"","","","","",null,null,0,{"$nulls":3},"No"]
[null,274,{"$nulls":5},"",null,"",{"$nulls":4},"",null,"",null,"No",null,"",{"v":0,"d":"0.0000"},"",{"v":0,"d":"0.00"},{"$f":"IF(R293=\"Interior\",IF(AND(L293=\"\",E293=\"\"),\"\",IF(OR(P293>0,O293=\"Enter Watts\",P293=\"\"),P293*N293*(1-X293)/1000,O293*N293(1-X293)/1000)),IF(AND(E293=\"\",L293=\"\"),\"\",0))","v":""},"","","","","",null,null,0,{"$nulls":3},"No"]
[null,275,{"$nulls":5},"",null,"",{"$nulls":4},"",null,"",null,"No",null,"",{"v":0,"d":"0.0000"},"",{"v":0,"d":"0.00"},{"$f":"IF(R294=\"Interior\",IF(AND(L294=\"\",E294=\"\"),\"\",IF(OR(P294>0,O294=\"Enter Watts\",P294=\"\"),P294*N294*(1-X294)/1000,O294*N294(1-X294)/1000)),IF(AND(E294=\"\",L294=\"\"),\"\",0))","v":""},"","","","","",null,null,0,{"$nulls":3},"No",{"$nulls":6},"","",null,""]
[null,276,{"$nulls":5},"",null,"",{"$nulls":4},"",null,"",null,"No",null,"",{"v":0,"d":"0.0000"},"",{"v":0,"d":"0.00"},{"$f":"IF(R295=\"Interior\",IF(AND(L295=\"\",E295=\"\"),\"\",IF(OR(P295>0,O295=\"Enter Watts\",P295=\"\"),P295*N295*(1-X295)/1000,O295*N295(1-X295)/1000)),IF(AND(E295=\"\",L295=\"\"),\"\",0))","v":""},"","","","","",null,null,0,{"$nulls":3},"No"]
[null,277,{"$nulls":5},"",null,"",{"$nulls":4},"",null,"",null,"No",null,"",{"v":0,"d":"0.0000"},"",{"v":0,"d":"0.00"},{"$f":"IF(R296=\"Interior\",IF(AND(L296=\"\",E296=\"\"),\"\",IF(OR(P296>0,O296=\"Enter Watts\",P296=\"\"),P296*N296*(1-X296)/1000,O296*N296(1-X296)/1000)),IF(AND(E296=\"\",L296=\"\"),\"\",0))","v":""},"","","","","",null,null,0,{"$nulls":3},"No"]
[null,278,{"$nulls":5},"",null,"",{"$nulls":4},"",null,"",null,"No",null,"",{"v":0,"d":"0.0000"},"",{"v":0,"d":"0.00"},{"$f":"IF(R297=\"Interior\",IF(AND(L297=\"\",E297=\"\"),\"\",IF(OR(P297>0,O297=\"Enter Watts\",P297=\"\"),P297*N297*(1-X297)/1000,O297*N297(1-X297)/1000)),IF(AND(E297=\"\",L297=\"\"),\"\",0))","v":""},"","","","","",null,null,0,{"$nulls":3},"No"]
[null,279,{"$nulls":5},"",null,"",{"$nulls":4},"",null,"",null,"No",null,"",{"v":0,"d":"0.0000"},"",{"v":0,"d":"0.00"},{"$f":"IF(R298=\"Interior\",IF(AND(L298=\"\",E298=\"\"),\"\",IF(OR(P298>0,O298=\"Enter Watts\",P298=\"\"),P298*N298*(1-X298)/1000,O298*N298(1-X298)/1000)),IF(AND(E298=\"\",L298=\"\"),\"\",0))","v":""},"","","","","",null,null,0,{"$nulls":3},"No"]
[null,280,{"$nulls":5},"",null,"",{"$nulls":4},"",null,"",null,"No",null,"",{"v":0,"d":"0.0000"},"",{"v":0,"d":"0.00"},{"$f":"IF(R299=\"Interior\",IF(AND(L299=\"\",E299=\"\"),\"\",IF(OR(P299>0,O299=\"Enter Watts\",P299=\"\"),P299*N299*(1-X299)/1000,O299*N299(1-X299)/1000)),IF(AND(E299=\"\",L299=\"\"),\"\",0))","v":""},"","","","","",null,null,0,{"$nulls":3},"No"]
[null,281,{"$nulls":5},"",null,"",{"$nulls":4},"",null,"",null,"No",null,"",{"v":0,"d":"0.0000"},"",{"v":0,"d":"0.00"},{"$f":"IF(R300=\"Interior\",IF(AND(L300=\"\",E300=\"\"),\"\",IF(OR(P300>0,O300=\"Enter Watts\",P300=\"\"),P300*N300*(1-X300)/1000,O300*N300(1-X300)/1000)),IF(AND(E300=\"\",L300=\"\"),\"\",0))","v":""},"","","","","",null,null,0,{"$nulls":3},"No"]
[null,282,{"$nulls":5},"",null,"",{"$nulls":4},"",null,"",null,"No",null,"",{"v":0,"d":"0.0000"},"",{"v":0,"d":"0.00"},{"$f":"IF(R301=\"Interior\",IF(AND(L301=\"\",E301=\"\"),\"\",IF(OR(P301>0,O301=\"Enter Watts\",P301=\"\"),P301*N301*(1-X301)/1000,O301*N301(1-X301)/1000)),IF(AND(E301=\"\",L301=\"\"),\"\",0))","v":""},"","","","","",null,null,0,{"$nulls":3},"No"]
[null,283,{"$nulls":5},"",null,"",{"$nulls":4},"",null,"",null,"No",null,"",{"v":0,"d":"0.0000"},"",{"v":0,"d":"0.00"},{"$f":"IF(R302=\"Interior\",IF(AND(L302=\"\",E302=\"\"),\"\",IF(OR(P302>0,O302=\"Enter Watts\",P302=\"\"),P302*N302*(1-X302)/1000,O302*N302(1-X302)/1000)),IF(AND(E302=\"\",L302=\"\"),\"\",0))","v":""},"","","","","",null,null,0,{"$nulls":3},"No"]
[null,284,{"$nulls":5},"",null,"",{"$nulls":4},"",null,"",null,"No",null,"",{"v":0,"d":"0.0000"},"",{"v":0,"d":"0.00"},{"$f":"IF(R303=\"Interior\",IF(AND(L303=\"\",E303=\"\"),\"\",IF(OR(P303>0,O303=\"Enter Watts\",P303=\"\"),P303*N303*(1-X303)/1000,O303*N303(1-X303)/1000)),IF(AND(E303=\"\",L303=\"\"),\"\",0))","v":""},"","","","","",null,null,0,{"$nulls":3},"No"]
[null,285,{"$nulls":5},"",null,"",{"$nulls":4},"",null,"",null,"No",null,"",{"v":0,"d":"0.0000"},"",{"v":0,"d":"0.00"},{"$f":"IF(R304=\"Interior\",IF(AND(L304=\"\",E304=\"\"),\"\",IF(OR(P304>0,O304=\"Enter Watts\",P304=\"\"),P304*N304*(1-X304)/1000,O304*N304(1-X304)/1000)),IF(AND(E304=\"\",L304=\"\"),\"\",0))","v":""},"","","","","",null,null,0,{"$nulls":3},"No"]
[null,286,{"$nulls":5},"",null,"",{"$nulls":4},"",null,"",null,"No",null,"",{"v":0,"d":"0.0000"},"",{"v":0,"d":"0.00"},{"$f":"IF(R305=\"Interior\",IF(AND(L305=\"\",E305=\"\"),\"\",IF(OR(P305>0,O305=\"Enter Watts\",P305=\"\"),P305*N305*(1-X305)/1000,O305*N305(1-X305)/1000)),IF(AND(E305=\"\",L305=\"\"),\"\",0))","v":""},"","","","","",null,null,0,{"$nulls":3},"No"]
[null,287,{"$nulls":5},"",null,"",{"$nulls":4},"",null,"",null,"No",null,"",{"v":0,"d":"0.0000"},"",{"v":0,"d":"0.00"},{"$f":"IF(R306=\"Interior\",IF(AND(L306=\"\",E306=\"\"),\"\",IF(OR(P306>0,O306=\"Enter Watts\",P306=\"\"),P306*N306*(1-X306)/1000,O306*N306(1-X306)/1000)),IF(AND(E306=\"\",L306=\"\"),\"\",0))","v":""},"","","","","",null,null,0,{"$nulls":3},"No",{"$nulls":6},"","",null,""]
[null,288,{"$nulls":5},"",null,"",{"$nulls":4},"",null,"",null,"No",null,"",{"v":0,"d":"0.0000"},"",{"v":0,"d":"0.00"},{"$f":"IF(R307=\"Interior\",IF(AND(L307=\"\",E307=\"\"),\"\",IF(OR(P307>0,O307=\"Enter Watts\",P307=\"\"),P307*N307*(1-X307)/1000,O307*N307(1-X307)/1000)),IF(AND(E307=\"\",L307=\"\"),\"\",0))","v":""},"","","","","",null,null,0,{"$nulls":3},"No"]
[null,289,{"$nulls":5},"",null,"",{"$nulls":4},"",null,"",null,"No",null,"",{"v":0,"d":"0.0000"},"",{"v":0,"d":"0.00"},{"$f":"IF(R308=\"Interior\",IF(AND(L308=\"\",E308=\"\"),\"\",IF(OR(P308>0,O308=\"Enter Watts\",P308=\"\"),P308*N308*(1-X308)/1000,O308*N308(1-X308)/1000)),IF(AND(E308=\"\",L308=\"\"),\"\",0))","v":""},"","","","","",null,null,0,{"$nulls":3},"No"]
[null,290,{"$nulls":5},"",null,"",{"$nulls":4},"",null,"",null,"No",null,"",{"v":0,"d":"0.0000"},"",{"v":0,"d":"0.00"},{"$f":"IF(R309=\"Interior\",IF(AND(L309=\"\",E309=\"\"),\"\",IF(OR(P309>0,O309=\"Enter Watts\",P309=\"\"),P309*N309*(1-X309)/1000,O309*N309(1-X309)/1000)),IF(AND(E309=\"\",L309=\"\"),\"\",0))","v":""},"","","","","",null,null,0,{"$nulls":3},"No"]
[null,291,{"$nulls":5},"",null,"",{"$nulls":4},"",null,"",null,"No",null,"",{"v":0,"d":"0.0000"},"",{"v":0,"d":"0.00"},{"$f":"IF(R310=\"Interior\",IF(AND(L310=\"\",E310=\"\"),\"\",IF(OR(P310>0,O310=\"Enter Watts\",P310=\"\"),P310*N310*(1-X310)/1000,O310*N310(1-X310)/1000)),IF(AND(E310=\"\",L310=\"\"),\"\",0))","v":""},"","","","","",null,null,0,{"$nulls":3},"No"]
[null,292,{"$nulls":5},"",null,"",{"$nulls":4},"",null,"",null,"No",null,"",{"v":0,"d":"0.0000"},"",{"v":0,"d":"0.00"},{"$f":"IF(R311=\"Interior\",IF(AND(L311=\"\",E311=\"\"),\"\",IF(OR(P311>0,O311=\"Enter Watts\",P311=\"\"),P311*N311*(1-X311)/1000,O311*N311(1-X311)/1000)),IF(AND(E311=\"\",L311=\"\"),\"\",0))","v":""},"","","","","",null,null,0,{"$nulls":3},"No"]
[null,293,{"$nulls":5},"",null,"",{"$nulls":4},"",null,"",null,"No",null,"",{"v":0,"d":"0.0000"},"",{"v":0,"d":"0.00"},{"$f":"IF(R312=\"Interior\",IF(AND(L312=\"\",E312=\"\"),\"\",IF(OR(P312>0,O312=\"Enter Watts\",P312=\"\"),P312*N312*(1-X312)/1000,O312*N312(1-X312)/1000)),IF(AND(E312=\"\",L312=\"\"),\"\",0))","v":""},"","","","","",null,null,0,{"$nulls":3},"No",{"$nulls":6},"","",null,""]
[null,294,{"$nulls":5},"",null,"",{"$nulls":4},"",null,"",null,"No",null,"",{"v":0,"d":"0.0000"},"",{"v":0,"d":"0.00"},{"$f":"IF(R313=\"Interior\",IF(AND(L313=\"\",E313=\"\"),\"\",IF(OR(P313>0,O313=\"Enter Watts\",P313=\"\"),P313*N313*(1-X313)/1000,O313*N313(1-X313)/1000)),IF(AND(E313=\"\",L313=\"\"),\"\",0))","v":""},"","","","","",null,null,0,{"$nulls":3},"No"]
[null,295,{"$nulls":5},"",null,"",{"$nulls":4},"",null,"",null,"No",null,"",{"v":0,"d":"0.0000"},"",{"v":0,"d":"0.00"},{"$f":"IF(R314=\"Interior\",IF(AND(L314=\"\",E314=\"\"),\"\",IF(OR(P314>0,O314=\"Enter Watts\",P314=\"\"),P314*N314*(1-X314)/1000,O314*N314(1-X314)/1000)),IF(AND(E314=\"\",L314=\"\"),\"\",0))","v":""},"","","","","",null,null,0,{"$nulls":3},"No"]
[null,296,{"$nulls":5},"",null,"",{"$nulls":4},"",null,"",null,"No",null,"",{"v":0,"d":"0.0000"},"",{"v":0,"d":"0.00"},{"$f":"IF(R315=\"Interior\",IF(AND(L315=\"\",E315=\"\"),\"\",IF(OR(P315>0,O315=\"Enter Watts\",P315=\"\"),P315*N315*(1-X315)/1000,O315*N315(1-X315)/1000)),IF(AND(E315=\"\",L315=\"\"),\"\",0))","v":""},"","","","","",null,null,0,{"$nulls":3},"No"]
[null,297,{"$nulls":5},"",null,"",{"$nulls":4},"",null,"",null,"No",null,"",{"v":0,"d":"0.0000"},"",{"v":0,"d":"0.00"},{"$f":"IF(R316=\"Interior\",IF(AND(L316=\"\",E316=\"\"),\"\",IF(OR(P316>0,O316=\"Enter Watts\",P316=\"\"),P316*N316*(1-X316)/1000,O316*N316(1-X316)/1000)),IF(AND(E316=\"\",L316=\"\"),\"\",0))","v":""},"","","","","",null,null,0,{"$nulls":3},"No"]
[null,298,{"$nulls":5},"",null,"",{"$nulls":4},"",null,"",null,"No",null,"",{"v":0,"d":"0.0000"},"",{"v":0,"d":"0.00"},{"$f":"IF(R317=\"Interior\",IF(AND(L317=\"\",E317=\"\"),\"\",IF(OR(P317>0,O317=\"Enter Watts\",P317=\"\"),P317*N317*(1-X317)/1000,O317*N317(1-X317)/1000)),IF(AND(E317=\"\",L317=\"\"),\"\",0))","v":""},"","","","","",null,null,0,{"$nulls":3},"No"]
[null,299,{"$nulls":5},"",null,"",{"$nulls":4},"",null,"",null,"No",null,"",{"v":0,"d":"0.0000"},"",{"v":0,"d":"0.00"},{"$f":"IF(R318=\"Interior\",IF(AND(L318=\"\",E318=\"\"),\"\",IF(OR(P318>0,O318=\"Enter Watts\",P318=\"\"),P318*N318*(1-X318)/1000,O318*N318(1-X318)/1000)),IF(AND(E318=\"\",L318=\"\"),\"\",0))","v":""},"","","","","",null,null,0,{"$nulls":3},"No"]
[null,300,{"$nulls":5},"",null,"",{"$nulls":4},"",null,"",null,"No",null,"",{"v":0,"d":"0.0000"},"",{"v":0,"d":"0.00"},{"$f":"IF(R319=\"Interior\",IF(AND(L319=\"\",E319=\"\"),\"\",IF(OR(P319>0,O319=\"Enter Watts\",P319=\"\"),P319*N319*(1-X319)/1000,O319*N319(1-X319)/1000)),IF(AND(E319=\"\",L319=\"\"),\"\",0))","v":""},"",{"$f":"IFERROR(IF(OR(I319>0,H319=\"Enter Watts\"),I319*G319,H319*G319)-IF(OR(P319>0,O319=\"Enter Watts\"),P319*N319,O319*N319),\"\")","v":""},"",{"$f":"IF(AND(W319=\"\",Z319=\"\"),\"\",IF(OR(W319=\"\",Z319=\"\"),0,W319-Z319))","v":""},"",null,null,0,{"$nulls":3},"No"]
[null,301,{"$nulls":5},{"$f":"IF(E320=\"\",\"\",VLOOKUP(E320,$AQ$1114:$AR$1541,2,FALSE))","v":""},null,"",{"$nulls":4},"",null,"",null,"No",null,"",{"v":0,"d":"0.0000"},"",{"v":0,"d":"0.00"},{"$f":"IF(R320=\"Interior\",IF(AND(L320=\"\",E320=\"\"),\"\",IF(OR(P320>0,O320=\"Enter Watts\",P320=\"\"),P320*N320*(1-X320)/1000,O320*N320(1-X320)/1000)),IF(AND(E320=\"\",L320=\"\"),\"\",0))","v":""},"",{"$f":"IFERROR(IF(OR(I320>0,H320=\"Enter Watts\"),I320*G320,H320*G320)-IF(OR(P320>0,O320=\"Enter Watts\"),P320*N320,O320*N320),\"\")","v":""},"",{"$f":"IF(AND(W320=\"\",Z320=\"\"),\"\",IF(OR(W320=\"\",Z320=\"\"),0,W320-Z320))","v":""},{"$f":"IF(AC320=\"\",\"\",IF(AND(R320=\"Interior\",S320=\"No\",OR(T320=\"\",T320=\"No\")),$J$1027,IF(AND(R320=\"Interior\",S320=\"Yes\"),$J$1028,IF(AND(R320=\"Exterior\",S320=\"Yes\"),$J$1029,IF(AND(R320=\"Exterior\",S320=\"No\",N320<>G320),\"DNQ\",\"See Lighting Catalog to determine Code\")))))","v":""},null,null,0,{"$nulls":3},"No"]
[null,302,{"$nulls":5},{"$f":"IF(E321=\"\",\"\",VLOOKUP(E321,$AQ$1114:$AR$1541,2,FALSE))","v":""},null,"",{"$nulls":4},"",null,{"$f":"IF(J321=\"\",\"\",J321)","v":""},null,"No",null,"",{"v":0,"d":"0.0000"},"",{"v":0,"d":"0.00"},{"$f":"IF(R321=\"Interior\",IF(AND(L321=\"\",E321=\"\"),\"\",IF(OR(P321>0,O321=\"Enter Watts\",P321=\"\"),P321*N321*(1-X321)/1000,O321*N321(1-X321)/1000)),IF(AND(E321=\"\",L321=\"\"),\"\",0))","v":""},"",{"$f":"IFERROR(IF(OR(I321>0,H321=\"Enter Watts\"),I321*G321,H321*G321)-IF(OR(P321>0,O321=\"Enter Watts\"),P321*N321,O321*N321),\"\")","v":""},"",{"$f":"IF(AND(W321=\"\",Z321=\"\"),\"\",IF(OR(W321=\"\",Z321=\"\"),0,W321-Z321))","v":""},{"$f":"IF(AC321=\"\",\"\",IF(AND(R321=\"Interior\",S321=\"No\",OR(T321=\"\",T321=\"No\")),$J$1027,IF(AND(R321=\"Interior\",S321=\"Yes\"),$J$1028,IF(AND(R321=\"Exterior\",S321=\"Yes\"),$J$1029,IF(AND(R321=\"Exterior\",S321=\"No\",N321<>G321),\"DNQ\",\"See Lighting Catalog to determine Code\")))))","v":""},null,null,0,{"$nulls":3},"No"]
[null,303,{"$nulls":5},"",null,"",{"$nulls":4},"",null,"",null,"No",null,"",{"v":0,"d":"0.0000"},"",{"v":0,"d":"0.00"},{"$f":"IF(R322=\"Interior\",IF(AND(L322=\"\",E322=\"\"),\"\",IF(OR(P322>0,O322=\"Enter Watts\",P322=\"\"),P322*N322*(1-X322)/1000,O322*N322(1-X322)/1000)),IF(AND(E322=\"\",L322=\"\"),\"\",0))","v":""},"",{"$f":"IFERROR(IF(OR(I322>0,H322=\"Enter Watts\"),I322*G322,H322*G322)-IF(OR(P322>0,O322=\"Enter Watts\"),P322*N322,O322*N322),\"\")","v":""},"",{"$f":"IF(AND(W322=\"\",Z322=\"\"),\"\",IF(OR(W322=\"\",Z322=\"\"),0,W322-Z322))","v":""},"",null,null,0,{"$nulls":3},"No"]
[null,304,{"$nulls":5},"",null,"",{"$nulls":4},"",null,"",null,"No",null,"",{"v":0,"d":"0.0000"},"",{"v":0,"d":"0.00"},{"$f":"IF(R323=\"Interior\",IF(AND(L323=\"\",E323=\"\"),\"\",IF(OR(P323>0,O323=\"Enter Watts\",P323=\"\"),P323*N323*(1-X323)/1000,O323*N323(1-X323)/1000)),IF(AND(E323=\"\",L323=\"\"),\"\",0))","v":""},"","","","","",null,null,0,{"$nulls":3},"No"]
[null,305,{"$nulls":5},"",null,"",{"$nulls":4},"",null,"",null,"No",null,"",{"v":0,"d":"0.0000"},"",{"v":0,"d":"0.00"},{"$f":"IF(R324=\"Interior\",IF(AND(L324=\"\",E324=\"\"),\"\",IF(OR(P324>0,O324=\"Enter Watts\",P324=\"\"),P324*N324*(1-X324)/1000,O324*N324(1-X324)/1000)),IF(AND(E324=\"\",L324=\"\"),\"\",0))","v":""},"","","","","",null,null,0,{"$nulls":3},"No"]
[null,306,{"$nulls":5},"",null,"",{"$nulls":4},"",null,"",null,"No",null,"",{"v":0,"d":"0.0000"},"",{"v":0,"d":"0.00"},{"$f":"IF(R325=\"Interior\",IF(AND(L325=\"\",E325=\"\"),\"\",IF(OR(P325>0,O325=\"Enter Watts\",P325=\"\"),P325*N325*(1-X325)/1000,O325*N325(1-X325)/1000)),IF(AND(E325=\"\",L325=\"\"),\"\",0))","v":""},"","","","","",null,null,0,{"$nulls":3},"No",{"$nulls":6},"","",null,""]
[null,307,{"$nulls":5},"",null,"",{"$nulls":4},"",null,"",null,"No",null,"",{"v":0,"d":"0.0000"},"",{"v":0,"d":"0.00"},{"$f":"IF(R326=\"Interior\",IF(AND(L326=\"\",E326=\"\"),\"\",IF(OR(P326>0,O326=\"Enter Watts\",P326=\"\"),P326*N326*(1-X326)/1000,O326*N326(1-X326)/1000)),IF(AND(E326=\"\",L326=\"\"),\"\",0))","v":""},"","","","","",null,null,0,{"$nulls":3},"No"]
[null,308,{"$nulls":5},"",null,"",{"$nulls":4},"",null,"",null,"No",null,"",{"v":0,"d":"0.0000"},"",{"v":0,"d":"0.00"},{"$f":"IF(R327=\"Interior\",IF(AND(L327=\"\",E327=\"\"),\"\",IF(OR(P327>0,O327=\"Enter Watts\",P327=\"\"),P327*N327*(1-X327)/1000,O327*N327(1-X327)/1000)),IF(AND(E327=\"\",L327=\"\"),\"\",0))","v":""},"","","","","",null,null,0,{"$nulls":3},"No"]
[null,309,{"$nulls":5},"",null,"",{"$nulls":4},"",null,"",null,"No",null,"",{"v":0,"d":"0.0000"},"",{"v":0,"d":"0.00"},{"$f":"IF(R328=\"Interior\",IF(AND(L328=\"\",E328=\"\"),\"\",IF(OR(P328>0,O328=\"Enter Watts\",P328=\"\"),P328*N328*(1-X328)/1000,O328*N328(1-X328)/1000)),IF(AND(E328=\"\",L328=\"\"),\"\",0))","v":""},"","","","","",null,null,0,{"$nulls":3},"No"]
[null,310,{"$nulls":5},"",null,"",{"$nulls":4},"",null,"",null,"No",null,"",{"v":0,"d":"0.0000"},"",{"v":0,"d":"0.00"},{"$f":"IF(R329=\"Interior\",IF(AND(L329=\"\",E329=\"\"),\"\",IF(OR(P329>0,O329=\"Enter Watts\",P329=\"\"),P329*N329*(1-X329)/1000,O329*N329(1-X329)/1000)),IF(AND(E329=\"\",L329=\"\"),\"\",0))","v":""},"","","","","",null,null,0,{"$nulls":3},"No"]
[null,311,{"$nulls":5},"",null,"",{"$nulls":4},"",null,"",null,"No",null,"",{"v":0,"d":"0.0000"},"",{"v":0,"d":"0.00"},{"$f":"IF(R330=\"Interior\",IF(AND(L330=\"\",E330=\"\"),\"\",IF(OR(P330>0,O330=\"Enter Watts\",P330=\"\"),P330*N330*(1-X330)/1000,O330*N330(1-X330)/1000)),IF(AND(E330=\"\",L330=\"\"),\"\",0))","v":""},"","","","","",null,null,0,{"$nulls":3},"No"]
[null,312,{"$nulls":5},"",null,"",{"$nulls":4},"",null,"",null,"No",null,"",{"v":0,"d":"0.0000"},"",{"v":0,"d":"0.00"},{"$f":"IF(R331=\"Interior\",IF(AND(L331=\"\",E331=\"\"),\"\",IF(OR(P331>0,O331=\"Enter Watts\",P331=\"\"),P331*N331*(1-X331)/1000,O331*N331(1-X331)/1000)),IF(AND(E331=\"\",L331=\"\"),\"\",0))","v":""},"","","","","",null,null,0,{"$nulls":3},"No",{"$nulls":6},"","",null,""]
[null,313,{"$nulls":5},"",null,"",{"$nulls":4},"",null,"",null,"No",null,"",{"v":0,"d":"0.0000"},"",{"v":0,"d":"0.00"},{"$f":"IF(R332=\"Interior\",IF(AND(L332=\"\",E332=\"\"),\"\",IF(OR(P332>0,O332=\"Enter Watts\",P332=\"\"),P332*N332*(1-X332)/1000,O332*N332(1-X332)/1000)),IF(AND(E332=\"\",L332=\"\"),\"\",0))","v":""},"","","","","",null,null,0,{"$nulls":3},"No"]
[null,314,{"$nulls":5},"",null,"",{"$nulls":4},"",null,"",null,"No",null,"",{"v":0,"d":"0.0000"},"",{"v":0,"d":"0.00"},{"$f":"IF(R333=\"Interior\",IF(AND(L333=\"\",E333=\"\"),\"\",IF(OR(P333>0,O333=\"Enter Watts\",P333=\"\"),P333*N333*(1-X333)/1000,O333*N333(1-X333)/1000)),IF(AND(E333=\"\",L333=\"\"),\"\",0))","v":""},"","","","","",null,null,0,{"$nulls":3},"No"]
[null,315,{"$nulls":5},"",null,"",{"$nulls":4},"",null,"",null,"No",null,"",{"v":0,"d":"0.0000"},"",{"v":0,"d":"0.00"},{"$f":"IF(R334=\"Interior\",IF(AND(L334=\"\",E334=\"\"),\"\",IF(OR(P334>0,O334=\"Enter Watts\",P334=\"\"),P334*N334*(1-X334)/1000,O334*N334(1-X334)/1000)),IF(AND(E334=\"\",L334=\"\"),\"\",0))","v":""},"","","","","",null,null,0,{"$nulls":3},"No"]
[null,316,{"$nulls":5},"",null,"",{"$nulls":4},"",null,"",null,"No",null,"",{"v":0,"d":"0.0000"},"",{"v":0,"d":"0.00"},{"$f":"IF(R335=\"Interior\",IF(AND(L335=\"\",E335=\"\"),\"\",IF(OR(P335>0,O335=\"Enter Watts\",P335=\"\"),P335*N335*(1-X335)/1000,O335*N335(1-X335)/1000)),IF(AND(E335=\"\",L335=\"\"),\"\",0))","v":""},"","","","","",null,null,0,{"$nulls":3},"No"]
[null,317,{"$nulls":5},"",null,"",{"$nulls":4},"",null,"",null,"No",null,"",{"v":0,"d":"0.0000"},"",{"v":0,"d":"0.00"},{"$f":"IF(R336=\"Interior\",IF(AND(L336=\"\",E336=\"\"),\"\",IF(OR(P336>0,O336=\"Enter Watts\",P336=\"\"),P336*N336*(1-X336)/1000,O336*N336(1-X336)/1000)),IF(AND(E336=\"\",L336=\"\"),\"\",0))","v":""},"","","","","",null,null,0,{"$nulls":3},"No"]
[null,318,{"$nulls":5},"",null,"",{"$nulls":4},"",null,"",null,"No",null,"",{"v":0,"d":"0.0000"},"",{"v":0,"d":"0.00"},{"$f":"IF(R337=\"Interior\",IF(AND(L337=\"\",E337=\"\"),\"\",IF(OR(P337>0,O337=\"Enter Watts\",P337=\"\"),P337*N337*(1-X337)/1000,O337*N337(1-X337)/1000)),IF(AND(E337=\"\",L337=\"\"),\"\",0))","v":""},"","","","","",null,null,0,{"$nulls":3},"No"]
[null,319,{"$nulls":5},"",null,"",{"$nulls":4},"",null,"",null,"No",null,"",{"v":0,"d":"0.0000"},"",{"v":0,"d":"0.00"},{"$f":"IF(R338=\"Interior\",IF(AND(L338=\"\",E338=\"\"),\"\",IF(OR(P338>0,O338=\"Enter Watts\",P338=\"\"),P338*N338*(1-X338)/1000,O338*N338(1-X338)/1000)),IF(AND(E338=\"\",L338=\"\"),\"\",0))","v":""},"","","","","",null,null,0,{"$nulls":3},"No",{"$nulls":6},"","",null,""]
[null,320,{"$nulls":5},"",null,"",{"$nulls":4},"",null,"",null,"No",null,"",{"v":0,"d":"0.0000"},"",{"v":0,"d":"0.00"},{"$f":"IF(R339=\"Interior\",IF(AND(L339=\"\",E339=\"\"),\"\",IF(OR(P339>0,O339=\"Enter Watts\",P339=\"\"),P339*N339*(1-X339)/1000,O339*N339(1-X339)/1000)),IF(AND(E339=\"\",L339=\"\"),\"\",0))","v":""},"","","","","",null,null,0,{"$nulls":3},"No"]
[null,321,{"$nulls":5},"",null,{"$f":"IF(AND(E340<>\"\",G340<>\"\",$E$8=\"Default Sector Hours\"),VLOOKUP(IF(R340=\"Exterior\",\"Exterior\",$E$7),$W$1036:$X$1041,2,FALSE),\"\")","v":""},{"$nulls":4},{"$f":"IF(L340=\"\",\"\",VLOOKUP(L340,$AQ$1113:$AR$1541,2,FALSE))","v":""},null,"",null,"No",null,"",{"v":0,"d":"0.0000"},"",{"v":0,"d":"0.00"},{"$f":"IF(R340=\"Interior\",IF(AND(L340=\"\",E340=\"\"),\"\",IF(OR(P340>0,O340=\"Enter Watts\",P340=\"\"),P340*N340*(1-X340)/1000,O340*N340(1-X340)/1000)),IF(AND(E340=\"\",L340=\"\"),\"\",0))","v":""},{"$f":"IFERROR(IF(AND(L340=\"\", E340=\"\"),\"\",N340/1000*IF(OR(P340>0,O340=\"Enter Watts\"),P340,O340)*IF(R340=\"Exterior\",$X$1041,IF($E$8=\"Manual Input\",Q340,VLOOKUP($E$7,$W$1036:$Z$1040,2,FALSE)))*IF(S340=\"Yes\",IF(R340=\"Exterior\",1-$Z$1041,1-VLOOKUP($E$7,$W$1036:$Z$1040,4,FALSE)),1)),0)","v":""},"",{"$f":"IF(AND(U340=\"\",Y340=\"\"),\"\",IF(OR(U340=\"\",Y340=\"\"),0,  IF($E$8=\"Manual Input\",$G$9,   VLOOKUP($E$7,$W$1036:$Z$1041,3,FALSE))     *(U340-Y340)))","v":""},"","",null,null,0,{"$nulls":3},"No"]
[null,322,{"$nulls":5},"",null,"",{"$nulls":4},"",null,"",null,"No",null,{"$f":"IF(V341=\"Int Control\",IF(E341=\"\",\"\",IF(OR(I341>0,H341=\"Enter Watts\"),I341*G341/1000*(1-$E$15),H341*G341/1000*(1-$E$15))),IF(E341=\"\",\"\",IF(OR(I341>0,H341=\"Enter Watts\"),I341*G341/1000,H341*G341/1000)))","v":""},{"$f":"IF(AND(R341=\"Interior\",S341=\"Yes\"),\"Int Control\",0)","v":{"v":0,"d":"0.0000"}},{"$f":"IFERROR(IF(V341=\"Int Control\",IF(E341=\"\",\"\",G341/1000*(1-$E$15)*IF(OR(I341>0,H341=\"Enter Watts\"),I341,H341)*IF(R341=\"Exterior\",$X$1041*(1-$G$15),IF($E$8=\"Manual Input\",J341,VLOOKUP($E$7,$W$1036:$Z$1040,2,FALSE)*(1-$E$15)))),IF(E341=\"\",\"\",G341/1000*IF(OR(I341>0,H341=\"Enter Watts\"),I341,H341)*IF(R341=\"Exterior\",$X$1041,IF($E$8=\"Manual Input\",J341,VLOOKUP($E$7,$W$1036:$Z$1040,2,FALSE))))),\"0\")","v":""},{"$f":"IF(S341=\"No\",0,AA$1036)","v":{"v":0,"d":"0.00"}},{"$f":"IF(R341=\"Interior\",IF(AND(L341=\"\",E341=\"\"),\"\",IF(OR(P341>0,O341=\"Enter Watts\",P341=\"\"),P341*N341*(1-X341)/1000,O341*N341(1-X341)/1000)),IF(AND(E341=\"\",L341=\"\"),\"\",0))","v":""},"","","","","",null,null,{"$f":"AF341*N341","v":0},{"$nulls":3},{"$f":"IF(_xlfn.ISFORMULA(J341)=TRUE,\"No\",\"Yes\")","v":"No"}]
[null,323,{"$nulls":5},"",null,"",{"$nulls":4},"",null,"",null,"No",null,"",{"v":0,"d":"0.0000"},"",{"v":0,"d":"0.00"},{"$f":"IF(R342=\"Interior\",IF(AND(L342=\"\",E342=\"\"),\"\",IF(OR(P342>0,O342=\"Enter Watts\",P342=\"\"),P342*N342*(1-X342)/1000,O342*N342(1-X342)/1000)),IF(AND(E342=\"\",L342=\"\"),\"\",0))","v":""},"","","","","",null,null,0,{"$nulls":3},"No"]
[null,324,{"$nulls":5},"",null,"",{"$nulls":4},"",null,"",null,"No",null,"",{"v":0,"d":"0.0000"},"",{"v":0,"d":"0.00"},{"$f":"IF(R343=\"Interior\",IF(AND(L343=\"\",E343=\"\"),\"\",IF(OR(P343>0,O343=\"Enter Watts\",P343=\"\"),P343*N343*(1-X343)/1000,O343*N343(1-X343)/1000)),IF(AND(E343=\"\",L343=\"\"),\"\",0))","v":""},"","","","","",null,null,0,{"$nulls":3},"No"]
[null,325,{"$nulls":5},"",null,"",{"$nulls":4},"",null,"",null,"No",null,"",{"v":0,"d":"0.0000"},"",{"v":0,"d":"0.00"},{"$f":"IF(R344=\"Interior\",IF(AND(L344=\"\",E344=\"\"),\"\",IF(OR(P344>0,O344=\"Enter Watts\",P344=\"\"),P344*N344*(1-X344)/1000,O344*N344(1-X344)/1000)),IF(AND(E344=\"\",L344=\"\"),\"\",0))","v":""},"","","","","",null,null,0,{"$nulls":3},"No",{"$nulls":6},"","",null,""]
[null,326,{"$nulls":5},"",null,"",{"$nulls":4},"",null,"",null,"No",null,"",{"v":0,"d":"0.0000"},"",{"v":0,"d":"0.00"},{"$f":"IF(R345=\"Interior\",IF(AND(L345=\"\",E345=\"\"),\"\",IF(OR(P345>0,O345=\"Enter Watts\",P345=\"\"),P345*N345*(1-X345)/1000,O345*N345(1-X345)/1000)),IF(AND(E345=\"\",L345=\"\"),\"\",0))","v":""},"","","","","",null,null,0,{"$nulls":3},"No"]
[null,327,{"$nulls":5},"",null,"",{"$nulls":4},"",null,"",null,"No",null,"",{"v":0,"d":"0.0000"},"",{"v":0,"d":"0.00"},{"$f":"IF(R346=\"Interior\",IF(AND(L346=\"\",E346=\"\"),\"\",IF(OR(P346>0,O346=\"Enter Watts\",P346=\"\"),P346*N346*(1-X346)/1000,O346*N346(1-X346)/1000)),IF(AND(E346=\"\",L346=\"\"),\"\",0))","v":""},"","","","","",null,null,0,{"$nulls":3},"No"]
[null,328,{"$nulls":5},"",null,"",{"$nulls":4},"",null,"",null,"No",null,"",{"v":0,"d":"0.0000"},"",{"v":0,"d":"0.00"},{"$f":"IF(R347=\"Interior\",IF(AND(L347=\"\",E347=\"\"),\"\",IF(OR(P347>0,O347=\"Enter Watts\",P347=\"\"),P347*N347*(1-X347)/1000,O347*N347(1-X347)/1000)),IF(AND(E347=\"\",L347=\"\"),\"\",0))","v":""},"","","","","",null,null,0,{"$nulls":3},"No"]
[null,329,{"$nulls":5},"",null,"",{"$nulls":4},"",null,"",null,"No",null,"",{"v":0,"d":"0.0000"},"",{"v":0,"d":"0.00"},{"$f":"IF(R348=\"Interior\",IF(AND(L348=\"\",E348=\"\"),\"\",IF(OR(P348>0,O348=\"Enter Watts\",P348=\"\"),P348*N348*(1-X348)/1000,O348*N348(1-X348)/1000)),IF(AND(E348=\"\",L348=\"\"),\"\",0))","v":""},"","","","","",null,null,0,{"$nulls":3},"No"]
[null,330,{"$nulls":5},"",null,"",{"$nulls":4},"",null,"",null,"No",null,"",{"v":0,"d":"0.0000"},"",{"v":0,"d":"0.00"},{"$f":"IF(R349=\"Interior\",IF(AND(L349=\"\",E349=\"\"),\"\",IF(OR(P349>0,O349=\"Enter Watts\",P349=\"\"),P349*N349*(1-X349)/1000,O349*N349(1-X349)/1000)),IF(AND(E349=\"\",L349=\"\"),\"\",0))","v":""},"","","","","",null,null,0,{"$nulls":3},"No"]
[null,331,{"$nulls":5},"",null,"",{"$nulls":4},"",null,"",null,"No",null,"",{"v":0,"d":"0.0000"},"",{"v":0,"d":"0.00"},{"$f":"IF(R350=\"Interior\",IF(AND(L350=\"\",E350=\"\"),\"\",IF(OR(P350>0,O350=\"Enter Watts\",P350=\"\"),P350*N350*(1-X350)/1000,O350*N350(1-X350)/1000)),IF(AND(E350=\"\",L350=\"\"),\"\",0))","v":""},"","","","","",null,null,0,{"$nulls":3},"No"]
[null,332,{"$nulls":5},"",null,"",{"$nulls":4},"",null,"",null,"No",null,"",{"v":0,"d":"0.0000"},"",{"v":0,"d":"0.00"},{"$f":"IF(R351=\"Interior\",IF(AND(L351=\"\",E351=\"\"),\"\",IF(OR(P351>0,O351=\"Enter Watts\",P351=\"\"),P351*N351*(1-X351)/1000,O351*N351(1-X351)/1000)),IF(AND(E351=\"\",L351=\"\"),\"\",0))","v":""},"","","","","",null,null,0,{"$nulls":3},"No"]
[null,333,{"$nulls":5},"",null,"",{"$nulls":4},"",null,"",null,"No",null,"",{"v":0,"d":"0.0000"},"",{"v":0,"d":"0.00"},{"$f":"IF(R352=\"Interior\",IF(AND(L352=\"\",E352=\"\"),\"\",IF(OR(P352>0,O352=\"Enter Watts\",P352=\"\"),P352*N352*(1-X352)/1000,O352*N352(1-X352)/1000)),IF(AND(E352=\"\",L352=\"\"),\"\",0))","v":""},"","","","","",null,null,0,{"$nulls":3},"No"]
[null,334,{"$nulls":5},"",null,"",{"$nulls":4},"",null,"",null,"No",null,"",{"v":0,"d":"0.0000"},"",{"v":0,"d":"0.00"},{"$f":"IF(R353=\"Interior\",IF(AND(L353=\"\",E353=\"\"),\"\",IF(OR(P353>0,O353=\"Enter Watts\",P353=\"\"),P353*N353*(1-X353)/1000,O353*N353(1-X353)/1000)),IF(AND(E353=\"\",L353=\"\"),\"\",0))","v":""},"","","","","",null,null,0,{"$nulls":3},"No"]
[null,335,{"$nulls":5},"",null,"",{"$nulls":4},"",null,"",null,"No",null,"",{"v":0,"d":"0.0000"},"",{"v":0,"d":"0.00"},{"$f":"IF(R354=\"Interior\",IF(AND(L354=\"\",E354=\"\"),\"\",IF(OR(P354>0,O354=\"Enter Watts\",P354=\"\"),P354*N354*(1-X354)/1000,O354*N354(1-X354)/1000)),IF(AND(E354=\"\",L354=\"\"),\"\",0))","v":""},"","","","","",null,null,0,{"$nulls":3},"No"]
[null,336,{"$nulls":5},"",null,"",{"$nulls":4},"",null,"",null,"No",null,"",{"v":0,"d":"0.0000"},"",{"v":0,"d":"0.00"},{"$f":"IF(R355=\"Interior\",IF(AND(L355=\"\",E355=\"\"),\"\",IF(OR(P355>0,O355=\"Enter Watts\",P355=\"\"),P355*N355*(1-X355)/1000,O355*N355(1-X355)/1000)),IF(AND(E355=\"\",L355=\"\"),\"\",0))","v":""},"","","","","",null,null,0,{"$nulls":3},"No"]
[null,337,{"$nulls":5},"",null,"",{"$nulls":4},"",null,"",null,"No",null,"",{"v":0,"d":"0.0000"},"",{"v":0,"d":"0.00"},{"$f":"IF(R356=\"Interior\",IF(AND(L356=\"\",E356=\"\"),\"\",IF(OR(P356>0,O356=\"Enter Watts\",P356=\"\"),P356*N356*(1-X356)/1000,O356*N356(1-X356)/1000)),IF(AND(E356=\"\",L356=\"\"),\"\",0))","v":""},"","","","","",null,null,0,{"$nulls":3},"No",{"$nulls":6},"","",null,""]
[null,338,{"$nulls":5},"",null,"",{"$nulls":4},"",null,"",null,"No",null,"",{"v":0,"d":"0.0000"},"",{"v":0,"d":"0.00"},{"$f":"IF(R357=\"Interior\",IF(AND(L357=\"\",E357=\"\"),\"\",IF(OR(P357>0,O357=\"Enter Watts\",P357=\"\"),P357*N357*(1-X357)/1000,O357*N357(1-X357)/1000)),IF(AND(E357=\"\",L357=\"\"),\"\",0))","v":""},"","","","","",null,null,0,{"$nulls":3},"No"]
[null,339,{"$nulls":5},"",null,"",{"$nulls":4},"",null,"",null,"No",null,"",{"v":0,"d":"0.0000"},"",{"v":0,"d":"0.00"},{"$f":"IF(R358=\"Interior\",IF(AND(L358=\"\",E358=\"\"),\"\",IF(OR(P358>0,O358=\"Enter Watts\",P358=\"\"),P358*N358*(1-X358)/1000,O358*N358(1-X358)/1000)),IF(AND(E358=\"\",L358=\"\"),\"\",0))","v":""},"","","","","",null,null,0,{"$nulls":3},"No"]
[null,340,{"$nulls":5},"",null,"",{"$nulls":4},"",null,"",null,"No",null,"",{"v":0,"d":"0.0000"},"",{"v":0,"d":"0.00"},{"$f":"IF(R359=\"Interior\",IF(AND(L359=\"\",E359=\"\"),\"\",IF(OR(P359>0,O359=\"Enter Watts\",P359=\"\"),P359*N359*(1-X359)/1000,O359*N359(1-X359)/1000)),IF(AND(E359=\"\",L359=\"\"),\"\",0))","v":""},"","","","","",null,null,0,{"$nulls":3},"No"]
[null,341,{"$nulls":5},"",null,"",{"$nulls":4},"",null,"",null,"No",null,"",{"v":0,"d":"0.0000"},"",{"v":0,"d":"0.00"},{"$f":"IF(R360=\"Interior\",IF(AND(L360=\"\",E360=\"\"),\"\",IF(OR(P360>0,O360=\"Enter Watts\",P360=\"\"),P360*N360*(1-X360)/1000,O360*N360(1-X360)/1000)),IF(AND(E360=\"\",L360=\"\"),\"\",0))","v":""},"","","","","",null,null,0,{"$nulls":3},"No"]
[null,342,{"$nulls":5},"",null,"",{"$nulls":4},"",null,"",null,"No",null,"",{"v":0,"d":"0.0000"},"",{"v":0,"d":"0.00"},{"$f":"IF(R361=\"Interior\",IF(AND(L361=\"\",E361=\"\"),\"\",IF(OR(P361>0,O361=\"Enter Watts\",P361=\"\"),P361*N361*(1-X361)/1000,O361*N361(1-X361)/1000)),IF(AND(E361=\"\",L361=\"\"),\"\",0))","v":""},"","","","","",null,null,0,{"$nulls":3},"No"]
[null,343,{"$nulls":5},"",null,"",{"$nulls":4},"",null,"",null,"No",null,"",{"v":0,"d":"0.0000"},"",{"v":0,"d":"0.00"},{"$f":"IF(R362=\"Interior\",IF(AND(L362=\"\",E362=\"\"),\"\",IF(OR(P362>0,O362=\"Enter Watts\",P362=\"\"),P362*N362*(1-X362)/1000,O362*N362(1-X362)/1000)),IF(AND(E362=\"\",L362=\"\"),\"\",0))","v":""},"","","","","",null,null,0,{"$nulls":3},"No",{"$nulls":6},"","",null,""]
[null,344,{"$nulls":5},"",null,"",{"$nulls":4},"",null,"",null,"No",null,"",{"v":0,"d":"0.0000"},"",{"v":0,"d":"0.00"},{"$f":"IF(R363=\"Interior\",IF(AND(L363=\"\",E363=\"\"),\"\",IF(OR(P363>0,O363=\"Enter Watts\",P363=\"\"),P363*N363*(1-X363)/1000,O363*N363(1-X363)/1000)),IF(AND(E363=\"\",L363=\"\"),\"\",0))","v":""},"","","","","",null,null,0,{"$nulls":3},"No"]
[null,345,{"$nulls":5},"",null,"",{"$nulls":4},"",null,"",null,"No",null,"",{"v":0,"d":"0.0000"},"",{"v":0,"d":"0.00"},{"$f":"IF(R364=\"Interior\",IF(AND(L364=\"\",E364=\"\"),\"\",IF(OR(P364>0,O364=\"Enter Watts\",P364=\"\"),P364*N364*(1-X364)/1000,O364*N364(1-X364)/1000)),IF(AND(E364=\"\",L364=\"\"),\"\",0))","v":""},"","","","","",null,null,0,{"$nulls":3},"No"]
[null,346,{"$nulls":5},"",null,"",{"$nulls":4},"",null,"",null,"No",null,"",{"v":0,"d":"0.0000"},"",{"v":0,"d":"0.00"},{"$f":"IF(R365=\"Interior\",IF(AND(L365=\"\",E365=\"\"),\"\",IF(OR(P365>0,O365=\"Enter Watts\",P365=\"\"),P365*N365*(1-X365)/1000,O365*N365(1-X365)/1000)),IF(AND(E365=\"\",L365=\"\"),\"\",0))","v":""},"","","","","",null,null,0,{"$nulls":3},"No"]
[null,347,{"$nulls":5},"",null,"",{"$nulls":4},"",null,"",null,"No",null,"",{"v":0,"d":"0.0000"},"",{"v":0,"d":"0.00"},{"$f":"IF(R366=\"Interior\",IF(AND(L366=\"\",E366=\"\"),\"\",IF(OR(P366>0,O366=\"Enter Watts\",P366=\"\"),P366*N366*(1-X366)/1000,O366*N366(1-X366)/1000)),IF(AND(E366=\"\",L366=\"\"),\"\",0))","v":""},"","","","","",null,null,0,{"$nulls":3},"No"]
[null,348,{"$nulls":5},"",null,"",{"$nulls":4},"",null,"",null,"No",null,"",{"v":0,"d":"0.0000"},"",{"v":0,"d":"0.00"},{"$f":"IF(R367=\"Interior\",IF(AND(L367=\"\",E367=\"\"),\"\",IF(OR(P367>0,O367=\"Enter Watts\",P367=\"\"),P367*N367*(1-X367)/1000,O367*N367(1-X367)/1000)),IF(AND(E367=\"\",L367=\"\"),\"\",0))","v":""},"","","","","",null,null,0,{"$nulls":3},"No"]
[null,349,{"$nulls":5},"",null,"",{"$nulls":4},"",null,"",null,"No",null,"",{"v":0,"d":"0.0000"},"",{"v":0,"d":"0.00"},{"$f":"IF(R368=\"Interior\",IF(AND(L368=\"\",E368=\"\"),\"\",IF(OR(P368>0,O368=\"Enter Watts\",P368=\"\"),P368*N368*(1-X368)/1000,O368*N368(1-X368)/1000)),IF(AND(E368=\"\",L368=\"\"),\"\",0))","v":""},"","","","","",null,null,0,{"$nulls":3},"No"]
[null,350,{"$nulls":5},"",null,"",{"$nulls":4},"",null,"",null,"No",null,"",{"v":0,"d":"0.0000"},"",{"v":0,"d":"0.00"},{"$f":"IF(R369=\"Interior\",IF(AND(L369=\"\",E369=\"\"),\"\",IF(OR(P369>0,O369=\"Enter Watts\",P369=\"\"),P369*N369*(1-X369)/1000,O369*N369(1-X369)/1000)),IF(AND(E369=\"\",L369=\"\"),\"\",0))","v":""},"",{"$f":"IFERROR(IF(OR(I369>0,H369=\"Enter Watts\"),I369*G369,H369*G369)-IF(OR(P369>0,O369=\"Enter Watts\"),P369*N369,O369*N369),\"\")","v":""},"",{"$f":"IF(AND(W369=\"\",Z369=\"\"),\"\",IF(OR(W369=\"\",Z369=\"\"),0,W369-Z369))","v":""},"",null,null,0,{"$nulls":3},"No"]
[null,351,{"$nulls":5},"",null,"",{"$nulls":4},"",null,"",null,"No",null,"",{"v":0,"d":"0.0000"},"",{"v":0,"d":"0.00"},{"$f":"IF(R370=\"Interior\",IF(AND(L370=\"\",E370=\"\"),\"\",IF(OR(P370>0,O370=\"Enter Watts\",P370=\"\"),P370*N370*(1-X370)/1000,O370*N370(1-X370)/1000)),IF(AND(E370=\"\",L370=\"\"),\"\",0))","v":""},"",{"$f":"IFERROR(IF(OR(I370>0,H370=\"Enter Watts\"),I370*G370,H370*G370)-IF(OR(P370>0,O370=\"Enter Watts\"),P370*N370,O370*N370),\"\")","v":""},"",{"$f":"IF(AND(W370=\"\",Z370=\"\"),\"\",IF(OR(W370=\"\",Z370=\"\"),0,W370-Z370))","v":""},"",null,null,0,{"$nulls":3},"No"]
[null,352,{"$nulls":5},"",null,"",{"$nulls":4},"",null,"",null,"No",null,"",{"v":0,"d":"0.0000"},"",{"v":0,"d":"0.00"},{"$f":"IF(R371=\"Interior\",IF(AND(L371=\"\",E371=\"\"),\"\",IF(OR(P371>0,O371=\"Enter Watts\",P371=\"\"),P371*N371*(1-X371)/1000,O371*N371(1-X371)/1000)),IF(AND(E371=\"\",L371=\"\"),\"\",0))","v":""},"","","","","",null,null,0,{"$nulls":3},"No"]
[null,353,{"$nulls":5},"",null,"",{"$nulls":4},"",null,"",null,"No",null,"",{"v":0,"d":"0.0000"},"",{"v":0,"d":"0.00"},{"$f":"IF(R372=\"Interior\",IF(AND(L372=\"\",E372=\"\"),\"\",IF(OR(P372>0,O372=\"Enter Watts\",P372=\"\"),P372*N372*(1-X372)/1000,O372*N372(1-X372)/1000)),IF(AND(E372=\"\",L372=\"\"),\"\",0))","v":""},"","","","","",null,null,0,{"$nulls":3},"No"]
[null,354,{"$nulls":5},"",null,"",{"$nulls":4},"",null,"",null,"No",null,"",{"v":0,"d":"0.0000"},"",{"v":0,"d":"0.00"},{"$f":"IF(R373=\"Interior\",IF(AND(L373=\"\",E373=\"\"),\"\",IF(OR(P373>0,O373=\"Enter Watts\",P373=\"\"),P373*N373*(1-X373)/1000,O373*N373(1-X373)/1000)),IF(AND(E373=\"\",L373=\"\"),\"\",0))","v":""},"","","","","",null,null,0,{"$nulls":3},"No",{"$nulls":6},"","",null,""]
[null,355,{"$nulls":5},"",null,"",{"$nulls":4},"",null,"",null,"No",null,"",{"v":0,"d":"0.0000"},"",{"v":0,"d":"0.00"},{"$f":"IF(R374=\"Interior\",IF(AND(L374=\"\",E374=\"\"),\"\",IF(OR(P374>0,O374=\"Enter Watts\",P374=\"\"),P374*N374*(1-X374)/1000,O374*N374(1-X374)/1000)),IF(AND(E374=\"\",L374=\"\"),\"\",0))","v":""},"","","","","",null,null,0,{"$nulls":3},"No"]
[null,356,{"$nulls":5},"",null,"",{"$nulls":4},"",null,"",null,"No",null,"",{"v":0,"d":"0.0000"},"",{"v":0,"d":"0.00"},{"$f":"IF(R375=\"Interior\",IF(AND(L375=\"\",E375=\"\"),\"\",IF(OR(P375>0,O375=\"Enter Watts\",P375=\"\"),P375*N375*(1-X375)/1000,O375*N375(1-X375)/1000)),IF(AND(E375=\"\",L375=\"\"),\"\",0))","v":""},"","","","","",null,null,0,{"$nulls":3},"No"]
[null,357,{"$nulls":5},"",null,"",{"$nulls":4},"",null,"",null,"No",null,"",{"v":0,"d":"0.0000"},"",{"v":0,"d":"0.00"},{"$f":"IF(R376=\"Interior\",IF(AND(L376=\"\",E376=\"\"),\"\",IF(OR(P376>0,O376=\"Enter Watts\",P376=\"\"),P376*N376*(1-X376)/1000,O376*N376(1-X376)/1000)),IF(AND(E376=\"\",L376=\"\"),\"\",0))","v":""},"","","","","",null,null,0,{"$nulls":3},"No"]
[null,358,{"$nulls":5},"",null,"",{"$nulls":4},"",null,"",null,"No",null,"",{"v":0,"d":"0.0000"},"",{"v":0,"d":"0.00"},{"$f":"IF(R377=\"Interior\",IF(AND(L377=\"\",E377=\"\"),\"\",IF(OR(P377>0,O377=\"Enter Watts\",P377=\"\"),P377*N377*(1-X377)/1000,O377*N377(1-X377)/1000)),IF(AND(E377=\"\",L377=\"\"),\"\",0))","v":""},"","","","","",null,null,0,{"$nulls":3},"No"]
[null,359,{"$nulls":5},"",null,"",{"$nulls":4},"",null,"",null,"No",null,"",{"v":0,"d":"0.0000"},"",{"v":0,"d":"0.00"},{"$f":"IF(R378=\"Interior\",IF(AND(L378=\"\",E378=\"\"),\"\",IF(OR(P378>0,O378=\"Enter Watts\",P378=\"\"),P378*N378*(1-X378)/1000,O378*N378(1-X378)/1000)),IF(AND(E378=\"\",L378=\"\"),\"\",0))","v":""},"","","","","",null,null,0,{"$nulls":3},"No"]
[null,360,{"$nulls":5},"",null,"",{"$nulls":4},"",null,"",null,"No",null,"",{"v":0,"d":"0.0000"},"",{"v":0,"d":"0.00"},{"$f":"IF(R379=\"Interior\",IF(AND(L379=\"\",E379=\"\"),\"\",IF(OR(P379>0,O379=\"Enter Watts\",P379=\"\"),P379*N379*(1-X379)/1000,O379*N379(1-X379)/1000)),IF(AND(E379=\"\",L379=\"\"),\"\",0))","v":""},"","","","","",null,null,0,{"$nulls":3},"No",{"$nulls":6},"","",null,""]
[null,361,{"$nulls":5},"",null,"",{"$nulls":4},"",null,"",null,"No",null,"",{"v":0,"d":"0.0000"},"",{"v":0,"d":"0.00"},{"$f":"IF(R380=\"Interior\",IF(AND(L380=\"\",E380=\"\"),\"\",IF(OR(P380>0,O380=\"Enter Watts\",P380=\"\"),P380*N380*(1-X380)/1000,O380*N380(1-X380)/1000)),IF(AND(E380=\"\",L380=\"\"),\"\",0))","v":""},"","","","","",null,null,0,{"$nulls":3},"No"]
[null,362,{"$nulls":5},"",null,"",{"$nulls":4},"",null,"",null,"No",null,"",{"v":0,"d":"0.0000"},"",{"v":0,"d":"0.00"},{"$f":"IF(R381=\"Interior\",IF(AND(L381=\"\",E381=\"\"),\"\",IF(OR(P381>0,O381=\"Enter Watts\",P381=\"\"),P381*N381*(1-X381)/1000,O381*N381(1-X381)/1000)),IF(AND(E381=\"\",L381=\"\"),\"\",0))","v":""},"","","","","",null,null,0,{"$nulls":3},"No"]
[null,363,{"$nulls":5},"",null,"",{"$nulls":4},"",null,"",null,"No",null,"",{"v":0,"d":"0.0000"},"",{"v":0,"d":"0.00"},{"$f":"IF(R382=\"Interior\",IF(AND(L382=\"\",E382=\"\"),\"\",IF(OR(P382>0,O382=\"Enter Watts\",P382=\"\"),P382*N382*(1-X382)/1000,O382*N382(1-X382)/1000)),IF(AND(E382=\"\",L382=\"\"),\"\",0))","v":""},"","","","","",null,null,0,{"$nulls":3},"No"]
[null,364,{"$nulls":5},"",null,"",{"$nulls":4},"",null,"",null,"No",null,"",{"v":0,"d":"0.0000"},"",{"v":0,"d":"0.00"},{"$f":"IF(R383=\"Interior\",IF(AND(L383=\"\",E383=\"\"),\"\",IF(OR(P383>0,O383=\"Enter Watts\",P383=\"\"),P383*N383*(1-X383)/1000,O383*N383(1-X383)/1000)),IF(AND(E383=\"\",L383=\"\"),\"\",0))","v":""},"","","","","",null,null,0,{"$nulls":3},"No"]
[null,365,{"$nulls":5},"",null,"",{"$nulls":4},"",null,"",null,"No",null,"",{"v":0,"d":"0.0000"},"",{"v":0,"d":"0.00"},{"$f":"IF(R384=\"Interior\",IF(AND(L384=\"\",E384=\"\"),\"\",IF(OR(P384>0,O384=\"Enter Watts\",P384=\"\"),P384*N384*(1-X384)/1000,O384*N384(1-X384)/1000)),IF(AND(E384=\"\",L384=\"\"),\"\",0))","v":""},"","","","","",null,null,0,{"$nulls":3},"No"]
[null,366,{"$nulls":5},{"$f":"IF(E385=\"\",\"\",VLOOKUP(E385,$AQ$1114:$AR$1541,2,FALSE))","v":""},null,"",{"$nulls":4},"",null,"",null,"No",null,"",{"v":0,"d":"0.0000"},"",{"v":0,"d":"0.00"},{"$f":"IF(R385=\"Interior\",IF(AND(L385=\"\",E385=\"\"),\"\",IF(OR(P385>0,O385=\"Enter Watts\",P385=\"\"),P385*N385*(1-X385)/1000,O385*N385(1-X385)/1000)),IF(AND(E385=\"\",L385=\"\"),\"\",0))","v":""},"","","","",{"$f":"IF(AC385=\"\",\"\",IF(AND(R385=\"Interior\",S385=\"No\",OR(T385=\"\",T385=\"No\")),$J$1027,IF(AND(R385=\"Interior\",S385=\"Yes\"),$J$1028,IF(AND(R385=\"Exterior\",S385=\"Yes\"),$J$1029,IF(AND(R385=\"Exterior\",S385=\"No\",N385<>G385),\"DNQ\",\"See Lighting Catalog to determine Code\")))))","v":""},null,null,0,{"$nulls":3},"No"]
[null,367,{"$nulls":5},"",null,"",{"$nulls":4},"",null,"",null,"No",null,"",{"v":0,"d":"0.0000"},"",{"v":0,"d":"0.00"},{"$f":"IF(R386=\"Interior\",IF(AND(L386=\"\",E386=\"\"),\"\",IF(OR(P386>0,O386=\"Enter Watts\",P386=\"\"),P386*N386*(1-X386)/1000,O386*N386(1-X386)/1000)),IF(AND(E386=\"\",L386=\"\"),\"\",0))","v":""},"","","","","",null,null,0,{"$nulls":3},"No",{"$nulls":6},"","",null,""]
[null,368,{"$nulls":5},"",null,"",{"$nulls":4},"",null,"",null,"No",null,"",{"v":0,"d":"0.0000"},"",{"v":0,"d":"0.00"},{"$f":"IF(R387=\"Interior\",IF(AND(L387=\"\",E387=\"\"),\"\",IF(OR(P387>0,O387=\"Enter Watts\",P387=\"\"),P387*N387*(1-X387)/1000,O387*N387(1-X387)/1000)),IF(AND(E387=\"\",L387=\"\"),\"\",0))","v":""},"","","","","",null,null,0,{"$nulls":3},"No"]
[null,369,{"$nulls":5},"",null,"",{"$nulls":4},"",null,"",null,"No",null,"",{"v":0,"d":"0.0000"},"",{"v":0,"d":"0.00"},{"$f":"IF(R388=\"Interior\",IF(AND(L388=\"\",E388=\"\"),\"\",IF(OR(P388>0,O388=\"Enter Watts\",P388=\"\"),P388*N388*(1-X388)/1000,O388*N388(1-X388)/1000)),IF(AND(E388=\"\",L388=\"\"),\"\",0))","v":""},"","","","","",null,null,0,{"$nulls":3},"No"]
[null,370,{"$nulls":5},"",null,"",{"$nulls":4},"",null,"",null,"No",null,"",{"v":0,"d":"0.0000"},"",{"v":0,"d":"0.00"},{"$f":"IF(R389=\"Interior\",IF(AND(L389=\"\",E389=\"\"),\"\",IF(OR(P389>0,O389=\"Enter Watts\",P389=\"\"),P389*N389*(1-X389)/1000,O389*N389(1-X389)/1000)),IF(AND(E389=\"\",L389=\"\"),\"\",0))","v":""},"","","","","",null,null,0,{"$nulls":3},"No"]
[null,371,{"$nulls":5},"",null,"",{"$nulls":4},"",null,"",null,"No",null,"",{"v":0,"d":"0.0000"},"",{"v":0,"d":"0.00"},{"$f":"IF(R390=\"Interior\",IF(AND(L390=\"\",E390=\"\"),\"\",IF(OR(P390>0,O390=\"Enter Watts\",P390=\"\"),P390*N390*(1-X390)/1000,O390*N390(1-X390)/1000)),IF(AND(E390=\"\",L390=\"\"),\"\",0))","v":""},"","","","","",null,null,0,{"$nulls":3},"No"]
[null,372,{"$nulls":5},"",null,"",{"$nulls":4},"",null,"",null,"No",null,"",{"v":0,"d":"0.0000"},"",{"v":0,"d":"0.00"},{"$f":"IF(R391=\"Interior\",IF(AND(L391=\"\",E391=\"\"),\"\",IF(OR(P391>0,O391=\"Enter Watts\",P391=\"\"),P391*N391*(1-X391)/1000,O391*N391(1-X391)/1000)),IF(AND(E391=\"\",L391=\"\"),\"\",0))","v":""},"","","","","",null,null,0,{"$nulls":3},"No"]
[null,373,{"$nulls":5},"",null,"",{"$nulls":4},"",null,"",null,"No",null,"",{"v":0,"d":"0.0000"},"",{"v":0,"d":"0.00"},{"$f":"IF(R392=\"Interior\",IF(AND(L392=\"\",E392=\"\"),\"\",IF(OR(P392>0,O392=\"Enter Watts\",P392=\"\"),P392*N392*(1-X392)/1000,O392*N392(1-X392)/1000)),IF(AND(E392=\"\",L392=\"\"),\"\",0))","v":""},"","","","","",null,null,0,{"$nulls":3},"No",{"$nulls":6},"","",null,""]
[null,374,{"$nulls":5},"",null,"",{"$nulls":4},"",null,"",null,"No",null,"",{"v":0,"d":"0.0000"},"",{"v":0,"d":"0.00"},{"$f":"IF(R393=\"Interior\",IF(AND(L393=\"\",E393=\"\"),\"\",IF(OR(P393>0,O393=\"Enter Watts\",P393=\"\"),P393*N393*(1-X393)/1000,O393*N393(1-X393)/1000)),IF(AND(E393=\"\",L393=\"\"),\"\",0))","v":""},"","","","","",null,null,0,{"$nulls":3},"No"]
[null,375,{"$nulls":5},"",null,"",{"$nulls":4},"",null,"",null,"No",null,"",{"v":0,"d":"0.0000"},"",{"v":0,"d":"0.00"},{"$f":"IF(R394=\"Interior\",IF(AND(L394=\"\",E394=\"\"),\"\",IF(OR(P394>0,O394=\"Enter Watts\",P394=\"\"),P394*N394*(1-X394)/1000,O394*N394(1-X394)/1000)),IF(AND(E394=\"\",L394=\"\"),\"\",0))","v":""},"","","","","",null,null,0,{"$nulls":3},"No"]
[null,376,{"$nulls":5},"",null,"",{"$nulls":4},"",null,"",null,"No",null,"",{"v":0,"d":"0.0000"},"",{"v":0,"d":"0.00"},{"$f":"IF(R395=\"Interior\",IF(AND(L395=\"\",E395=\"\"),\"\",IF(OR(P395>0,O395=\"Enter Watts\",P395=\"\"),P395*N395*(1-X395)/1000,O395*N395(1-X395)/1000)),IF(AND(E395=\"\",L395=\"\"),\"\",0))","v":""},"","","","","",null,null,0,{"$nulls":3},"No"]
[null,377,{"$nulls":5},"",null,"",{"$nulls":4},"",null,"",null,"No",null,"",{"v":0,"d":"0.0000"},"",{"v":0,"d":"0.00"},{"$f":"IF(R396=\"Interior\",IF(AND(L396=\"\",E396=\"\"),\"\",IF(OR(P396>0,O396=\"Enter Watts\",P396=\"\"),P396*N396*(1-X396)/1000,O396*N396(1-X396)/1000)),IF(AND(E396=\"\",L396=\"\"),\"\",0))","v":""},"","","","","",null,null,0,{"$nulls":3},"No"]
[null,378,{"$nulls":5},"",null,"",{"$nulls":4},"",null,"",null,"No",null,"",{"v":0,"d":"0.0000"},"",{"v":0,"d":"0.00"},{"$f":"IF(R397=\"Interior\",IF(AND(L397=\"\",E397=\"\"),\"\",IF(OR(P397>0,O397=\"Enter Watts\",P397=\"\"),P397*N397*(1-X397)/1000,O397*N397(1-X397)/1000)),IF(AND(E397=\"\",L397=\"\"),\"\",0))","v":""},"","","","","",null,null,0,{"$nulls":3},"No"]
[null,379,{"$nulls":5},"",null,"",{"$nulls":4},"",null,"",null,"No",null,"",{"v":0,"d":"0.0000"},"",{"v":0,"d":"0.00"},{"$f":"IF(R398=\"Interior\",IF(AND(L398=\"\",E398=\"\"),\"\",IF(OR(P398>0,O398=\"Enter Watts\",P398=\"\"),P398*N398*(1-X398)/1000,O398*N398(1-X398)/1000)),IF(AND(E398=\"\",L398=\"\"),\"\",0))","v":""},"","","","","",null,null,0,{"$nulls":3},"No"]
[null,380,{"$nulls":5},"",null,"",{"$nulls":4},"",null,"",null,"No",null,"",{"v":0,"d":"0.0000"},"",{"v":0,"d":"0.00"},{"$f":"IF(R399=\"Interior\",IF(AND(L399=\"\",E399=\"\"),\"\",IF(OR(P399>0,O399=\"Enter Watts\",P399=\"\"),P399*N399*(1-X399)/1000,O399*N399(1-X399)/1000)),IF(AND(E399=\"\",L399=\"\"),\"\",0))","v":""},"","","","","",null,null,0,{"$nulls":3},"No"]
[null,381,{"$nulls":5},"",null,"",{"$nulls":4},"",null,"",null,"No",null,"",{"v":0,"d":"0.0000"},"",{"v":0,"d":"0.00"},{"$f":"IF(R400=\"Interior\",IF(AND(L400=\"\",E400=\"\"),\"\",IF(OR(P400>0,O400=\"Enter Watts\",P400=\"\"),P400*N400*(1-X400)/1000,O400*N400(1-X400)/1000)),IF(AND(E400=\"\",L400=\"\"),\"\",0))","v":""},"","","","","",null,null,0,{"$nulls":3},"No"]
[null,382,{"$nulls":5},"",null,"",{"$nulls":4},"",null,"",null,"No",null,"",{"v":0,"d":"0.0000"},"",{"v":0,"d":"0.00"},{"$f":"IF(R401=\"Interior\",IF(AND(L401=\"\",E401=\"\"),\"\",IF(OR(P401>0,O401=\"Enter Watts\",P401=\"\"),P401*N401*(1-X401)/1000,O401*N401(1-X401)/1000)),IF(AND(E401=\"\",L401=\"\"),\"\",0))","v":""},"","","","","",null,null,0,{"$nulls":3},"No"]
[null,383,{"$nulls":5},"",null,"",{"$nulls":4},"",null,"",null,"No",null,"",{"v":0,"d":"0.0000"},"",{"v":0,"d":"0.00"},{"$f":"IF(R402=\"Interior\",IF(AND(L402=\"\",E402=\"\"),\"\",IF(OR(P402>0,O402=\"Enter Watts\",P402=\"\"),P402*N402*(1-X402)/1000,O402*N402(1-X402)/1000)),IF(AND(E402=\"\",L402=\"\"),\"\",0))","v":""},"","","","","",null,null,0,{"$nulls":3},"No"]
[null,384,{"$nulls":5},"",null,"",{"$nulls":4},"",null,"",null,"No",null,"",{"v":0,"d":"0.0000"},"",{"v":0,"d":"0.00"},{"$f":"IF(R403=\"Interior\",IF(AND(L403=\"\",E403=\"\"),\"\",IF(OR(P403>0,O403=\"Enter Watts\",P403=\"\"),P403*N403*(1-X403)/1000,O403*N403(1-X403)/1000)),IF(AND(E403=\"\",L403=\"\"),\"\",0))","v":""},"","","","","",null,null,0,{"$nulls":3},"No"]
[null,385,{"$nulls":5},"",null,{"$f":"IF(AND(E404<>\"\",G404<>\"\",$E$8=\"Default Sector Hours\"),VLOOKUP(IF(R404=\"Exterior\",\"Exterior\",$E$7),$W$1036:$X$1041,2,FALSE),\"\")","v":""},{"$nulls":4},{"$f":"IF(L404=\"\",\"\",VLOOKUP(L404,$AQ$1113:$AR$1541,2,FALSE))","v":""},null,"",null,"No",null,"",{"v":0,"d":"0.0000"},"",{"v":0,"d":"0.00"},{"$f":"IF(R404=\"Interior\",IF(AND(L404=\"\",E404=\"\"),\"\",IF(OR(P404>0,O404=\"Enter Watts\",P404=\"\"),P404*N404*(1-X404)/1000,O404*N404(1-X404)/1000)),IF(AND(E404=\"\",L404=\"\"),\"\",0))","v":""},{"$f":"IFERROR(IF(AND(L404=\"\", E404=\"\"),\"\",N404/1000*IF(OR(P404>0,O404=\"Enter Watts\"),P404,O404)*IF(R404=\"Exterior\",$X$1041,IF($E$8=\"Manual Input\",Q404,VLOOKUP($E$7,$W$1036:$Z$1040,2,FALSE)))*IF(S404=\"Yes\",IF(R404=\"Exterior\",1-$Z$1041,1-VLOOKUP($E$7,$W$1036:$Z$1040,4,FALSE)),1)),0)","v":""},"",{"$f":"IF(AND(U404=\"\",Y404=\"\"),\"\",IF(OR(U404=\"\",Y404=\"\"),0,  IF($E$8=\"Manual Input\",$G$9,   VLOOKUP($E$7,$W$1036:$Z$1041,3,FALSE))     *(U404-Y404)))","v":""},"","",null,null,0,{"$nulls":3},"No",{"$nulls":6},"","",null,""]
[null,386,{"$nulls":5},"",null,"",{"$nulls":4},"",null,"",null,"No",null,{"$f":"IF(V405=\"Int Control\",IF(E405=\"\",\"\",IF(OR(I405>0,H405=\"Enter Watts\"),I405*G405/1000*(1-$E$15),H405*G405/1000*(1-$E$15))),IF(E405=\"\",\"\",IF(OR(I405>0,H405=\"Enter Watts\"),I405*G405/1000,H405*G405/1000)))","v":""},{"$f":"IF(AND(R405=\"Interior\",S405=\"Yes\"),\"Int Control\",0)","v":{"v":0,"d":"0.0000"}},{"$f":"IFERROR(IF(V405=\"Int Control\",IF(E405=\"\",\"\",G405/1000*(1-$E$15)*IF(OR(I405>0,H405=\"Enter Watts\"),I405,H405)*IF(R405=\"Exterior\",$X$1041*(1-$G$15),IF($E$8=\"Manual Input\",J405,VLOOKUP($E$7,$W$1036:$Z$1040,2,FALSE)*(1-$E$15)))),IF(E405=\"\",\"\",G405/1000*IF(OR(I405>0,H405=\"Enter Watts\"),I405,H405)*IF(R405=\"Exterior\",$X$1041,IF($E$8=\"Manual Input\",J405,VLOOKUP($E$7,$W$1036:$Z$1040,2,FALSE))))),\"0\")","v":""},{"$f":"IF(S405=\"No\",0,AA$1036)","v":{"v":0,"d":"0.00"}},{"$f":"IF(R405=\"Interior\",IF(AND(L405=\"\",E405=\"\"),\"\",IF(OR(P405>0,O405=\"Enter Watts\",P405=\"\"),P405*N405*(1-X405)/1000,O405*N405(1-X405)/1000)),IF(AND(E405=\"\",L405=\"\"),\"\",0))","v":""},"","","","","",null,null,{"$f":"AF405*N405","v":0},{"$nulls":3},{"$f":"IF(_xlfn.ISFORMULA(J405)=TRUE,\"No\",\"Yes\")","v":"No"}]
[null,387,{"$nulls":5},"",null,"",{"$nulls":4},"",null,"",null,"No",null,"",{"v":0,"d":"0.0000"},"",{"v":0,"d":"0.00"},{"$f":"IF(R406=\"Interior\",IF(AND(L406=\"\",E406=\"\"),\"\",IF(OR(P406>0,O406=\"Enter Watts\",P406=\"\"),P406*N406*(1-X406)/1000,O406*N406(1-X406)/1000)),IF(AND(E406=\"\",L406=\"\"),\"\",0))","v":""},"","","","","",null,null,0,{"$nulls":3},"No"]
[null,388,{"$nulls":5},"",null,"",{"$nulls":4},"",null,"",null,"No",null,"",{"v":0,"d":"0.0000"},"",{"v":0,"d":"0.00"},{"$f":"IF(R407=\"Interior\",IF(AND(L407=\"\",E407=\"\"),\"\",IF(OR(P407>0,O407=\"Enter Watts\",P407=\"\"),P407*N407*(1-X407)/1000,O407*N407(1-X407)/1000)),IF(AND(E407=\"\",L407=\"\"),\"\",0))","v":""},"","","","","",null,null,0,{"$nulls":3},"No"]
[null,389,{"$nulls":5},"",null,"",{"$nulls":4},"",null,"",null,"No",null,"",{"v":0,"d":"0.0000"},"",{"v":0,"d":"0.00"},{"$f":"IF(R408=\"Interior\",IF(AND(L408=\"\",E408=\"\"),\"\",IF(OR(P408>0,O408=\"Enter Watts\",P408=\"\"),P408*N408*(1-X408)/1000,O408*N408(1-X408)/1000)),IF(AND(E408=\"\",L408=\"\"),\"\",0))","v":""},"","","","","",null,null,0,{"$nulls":3},"No"]
[null,390,{"$nulls":5},"",null,"",{"$nulls":4},"",null,"",null,"No",null,"",{"v":0,"d":"0.0000"},"",{"v":0,"d":"0.00"},{"$f":"IF(R409=\"Interior\",IF(AND(L409=\"\",E409=\"\"),\"\",IF(OR(P409>0,O409=\"Enter Watts\",P409=\"\"),P409*N409*(1-X409)/1000,O409*N409(1-X409)/1000)),IF(AND(E409=\"\",L409=\"\"),\"\",0))","v":""},"","","","","",null,null,0,{"$nulls":3},"No"]
[null,391,{"$nulls":5},"",null,"",{"$nulls":4},"",null,"",null,"No",null,"",{"v":0,"d":"0.0000"},"",{"v":0,"d":"0.00"},{"$f":"IF(R410=\"Interior\",IF(AND(L410=\"\",E410=\"\"),\"\",IF(OR(P410>0,O410=\"Enter Watts\",P410=\"\"),P410*N410*(1-X410)/1000,O410*N410(1-X410)/1000)),IF(AND(E410=\"\",L410=\"\"),\"\",0))","v":""},"","","","","",null,null,0,{"$nulls":3},"No",{"$nulls":6},"","",null,""]
[null,392,{"$nulls":5},"",null,"",{"$nulls":4},"",null,"",null,"No",null,"",{"v":0,"d":"0.0000"},"",{"v":0,"d":"0.00"},{"$f":"IF(R411=\"Interior\",IF(AND(L411=\"\",E411=\"\"),\"\",IF(OR(P411>0,O411=\"Enter Watts\",P411=\"\"),P411*N411*(1-X411)/1000,O411*N411(1-X411)/1000)),IF(AND(E411=\"\",L411=\"\"),\"\",0))","v":""},"","","","","",null,null,0,{"$nulls":3},"No"]
[null,393,{"$nulls":5},"",null,"",{"$nulls":4},"",null,"",null,"No",null,"",{"v":0,"d":"0.0000"},"",{"v":0,"d":"0.00"},{"$f":"IF(R412=\"Interior\",IF(AND(L412=\"\",E412=\"\"),\"\",IF(OR(P412>0,O412=\"Enter Watts\",P412=\"\"),P412*N412*(1-X412)/1000,O412*N412(1-X412)/1000)),IF(AND(E412=\"\",L412=\"\"),\"\",0))","v":""},"","","","","",null,null,0,{"$nulls":3},"No"]
[null,394,{"$nulls":5},"",null,"",{"$nulls":4},"",null,"",null,"No",null,"",{"v":0,"d":"0.0000"},"",{"v":0,"d":"0.00"},{"$f":"IF(R413=\"Interior\",IF(AND(L413=\"\",E413=\"\"),\"\",IF(OR(P413>0,O413=\"Enter Watts\",P413=\"\"),P413*N413*(1-X413)/1000,O413*N413(1-X413)/1000)),IF(AND(E413=\"\",L413=\"\"),\"\",0))","v":""},"","","","","",null,null,0,{"$nulls":3},"No"]
[null,395,{"$nulls":5},"",null,"",{"$nulls":4},"",null,"",null,"No",null,"",{"v":0,"d":"0.0000"},"",{"v":0,"d":"0.00"},{"$f":"IF(R414=\"Interior\",IF(AND(L414=\"\",E414=\"\"),\"\",IF(OR(P414>0,O414=\"Enter Watts\",P414=\"\"),P414*N414*(1-X414)/1000,O414*N414(1-X414)/1000)),IF(AND(E414=\"\",L414=\"\"),\"\",0))","v":""},"","","","","",null,null,0,{"$nulls":3},"No"]
[null,396,{"$nulls":5},"",null,"",{"$nulls":4},"",null,"",null,"No",null,"",{"v":0,"d":"0.0000"},"",{"v":0,"d":"0.00"},{"$f":"IF(R415=\"Interior\",IF(AND(L415=\"\",E415=\"\"),\"\",IF(OR(P415>0,O415=\"Enter Watts\",P415=\"\"),P415*N415*(1-X415)/1000,O415*N415(1-X415)/1000)),IF(AND(E415=\"\",L415=\"\"),\"\",0))","v":""},"","","","","",null,null,0,{"$nulls":3},"No"]
[null,397,{"$nulls":5},"",null,"",{"$nulls":4},"",null,"",null,"No",null,"",{"v":0,"d":"0.0000"},"",{"v":0,"d":"0.00"},{"$f":"IF(R416=\"Interior\",IF(AND(L416=\"\",E416=\"\"),\"\",IF(OR(P416>0,O416=\"Enter Watts\",P416=\"\"),P416*N416*(1-X416)/1000,O416*N416(1-X416)/1000)),IF(AND(E416=\"\",L416=\"\"),\"\",0))","v":""},"","","","","",null,null,0,{"$nulls":3},"No"]
[null,398,{"$nulls":5},"",null,"",{"$nulls":4},"",null,"",null,"No",null,"",{"v":0,"d":"0.0000"},"",{"v":0,"d":"0.00"},{"$f":"IF(R417=\"Interior\",IF(AND(L417=\"\",E417=\"\"),\"\",IF(OR(P417>0,O417=\"Enter Watts\",P417=\"\"),P417*N417*(1-X417)/1000,O417*N417(1-X417)/1000)),IF(AND(E417=\"\",L417=\"\"),\"\",0))","v":""},"",{"$f":"IFERROR(IF(OR(I417>0,H417=\"Enter Watts\"),I417*G417,H417*G417)-IF(OR(P417>0,O417=\"Enter Watts\"),P417*N417,O417*N417),\"\")","v":""},"",{"$f":"IF(AND(W417=\"\",Z417=\"\"),\"\",IF(OR(W417=\"\",Z417=\"\"),0,W417-Z417))","v":""},"",null,null,0,{"$nulls":3},"No"]
[null,399,{"$nulls":5},"",null,"",{"$nulls":4},"",null,"",null,"No",null,"",{"v":0,"d":"0.0000"},"",{"v":0,"d":"0.00"},{"$f":"IF(R418=\"Interior\",IF(AND(L418=\"\",E418=\"\"),\"\",IF(OR(P418>0,O418=\"Enter Watts\",P418=\"\"),P418*N418*(1-X418)/1000,O418*N418(1-X418)/1000)),IF(AND(E418=\"\",L418=\"\"),\"\",0))","v":""},"",{"$f":"IFERROR(IF(OR(I418>0,H418=\"Enter Watts\"),I418*G418,H418*G418)-IF(OR(P418>0,O418=\"Enter Watts\"),P418*N418,O418*N418),\"\")","v":""},"",{"$f":"IF(AND(W418=\"\",Z418=\"\"),\"\",IF(OR(W418=\"\",Z418=\"\"),0,W418-Z418))","v":""},"",null,null,0,{"$nulls":3},"No"]
[null,400,{"$nulls":5},"",null,"",{"$nulls":4},"",null,"",null,"No",null,"",{"v":0,"d":"0.0000"},"",{"v":0,"d":"0.00"},{"$f":"IF(R419=\"Interior\",IF(AND(L419=\"\",E419=\"\"),\"\",IF(OR(P419>0,O419=\"Enter Watts\",P419=\"\"),P419*N419*(1-X419)/1000,O419*N419(1-X419)/1000)),IF(AND(E419=\"\",L419=\"\"),\"\",0))","v":""},"","","","","",null,null,0,{"$nulls":3},"No"]
[null,401,{"$nulls":5},"",null,"",{"$nulls":4},"",null,"",null,"No",null,"",{"v":0,"d":"0.0000"},"",{"v":0,"d":"0.00"},{"$f":"IF(R420=\"Interior\",IF(AND(L420=\"\",E420=\"\"),\"\",IF(OR(P420>0,O420=\"Enter Watts\",P420=\"\"),P420*N420*(1-X420)/1000,O420*N420(1-X420)/1000)),IF(AND(E420=\"\",L420=\"\"),\"\",0))","v":""},"","","","","",null,null,0,{"$nulls":3},"No"]
[null,402,{"$nulls":5},"",null,"",{"$nulls":4},"",null,"",null,"No",null,"",{"v":0,"d":"0.0000"},"",{"v":0,"d":"0.00"},{"$f":"IF(R421=\"Interior\",IF(AND(L421=\"\",E421=\"\"),\"\",IF(OR(P421>0,O421=\"Enter Watts\",P421=\"\"),P421*N421*(1-X421)/1000,O421*N421(1-X421)/1000)),IF(AND(E421=\"\",L421=\"\"),\"\",0))","v":""},"","","","","",null,null,0,{"$nulls":3},"No",{"$nulls":6},"","",null,""]
[null,403,{"$nulls":5},"",null,"",{"$nulls":4},"",null,"",null,"No",null,"",{"v":0,"d":"0.0000"},"",{"v":0,"d":"0.00"},{"$f":"IF(R422=\"Interior\",IF(AND(L422=\"\",E422=\"\"),\"\",IF(OR(P422>0,O422=\"Enter Watts\",P422=\"\"),P422*N422*(1-X422)/1000,O422*N422(1-X422)/1000)),IF(AND(E422=\"\",L422=\"\"),\"\",0))","v":""},"","","","","",null,null,0,{"$nulls":3},"No"]
[null,404,{"$nulls":5},"",null,"",{"$nulls":4},"",null,"",null,"No",null,"",{"v":0,"d":"0.0000"},"",{"v":0,"d":"0.00"},{"$f":"IF(R423=\"Interior\",IF(AND(L423=\"\",E423=\"\"),\"\",IF(OR(P423>0,O423=\"Enter Watts\",P423=\"\"),P423*N423*(1-X423)/1000,O423*N423(1-X423)/1000)),IF(AND(E423=\"\",L423=\"\"),\"\",0))","v":""},"","","","","",null,null,0,{"$nulls":3},"No"]
[null,405,{"$nulls":5},"",null,"",{"$nulls":4},"",null,"",null,"No",null,"",{"v":0,"d":"0.0000"},"",{"v":0,"d":"0.00"},{"$f":"IF(R424=\"Interior\",IF(AND(L424=\"\",E424=\"\"),\"\",IF(OR(P424>0,O424=\"Enter Watts\",P424=\"\"),P424*N424*(1-X424)/1000,O424*N424(1-X424)/1000)),IF(AND(E424=\"\",L424=\"\"),\"\",0))","v":""},"","","","","",null,null,0,{"$nulls":3},"No"]
[null,406,{"$nulls":5},"",null,"",{"$nulls":4},"",null,"",null,"No",null,"",{"v":0,"d":"0.0000"},"",{"v":0,"d":"0.00"},{"$f":"IF(R425=\"Interior\",IF(AND(L425=\"\",E425=\"\"),\"\",IF(OR(P425>0,O425=\"Enter Watts\",P425=\"\"),P425*N425*(1-X425)/1000,O425*N425(1-X425)/1000)),IF(AND(E425=\"\",L425=\"\"),\"\",0))","v":""},"","","","","",null,null,0,{"$nulls":3},"No"]
[null,407,{"$nulls":5},"",null,"",{"$nulls":4},"",null,"",null,"No",null,"",{"v":0,"d":"0.0000"},"",{"v":0,"d":"0.00"},{"$f":"IF(R426=\"Interior\",IF(AND(L426=\"\",E426=\"\"),\"\",IF(OR(P426>0,O426=\"Enter Watts\",P426=\"\"),P426*N426*(1-X426)/1000,O426*N426(1-X426)/1000)),IF(AND(E426=\"\",L426=\"\"),\"\",0))","v":""},"","","","","",null,null,0,{"$nulls":3},"No"]
[null,408,{"$nulls":5},"",null,"",{"$nulls":4},"",null,"",null,"No",null,"",{"v":0,"d":"0.0000"},"",{"v":0,"d":"0.00"},{"$f":"IF(R427=\"Interior\",IF(AND(L427=\"\",E427=\"\"),\"\",IF(OR(P427>0,O427=\"Enter Watts\",P427=\"\"),P427*N427*(1-X427)/1000,O427*N427(1-X427)/1000)),IF(AND(E427=\"\",L427=\"\"),\"\",0))","v":""},"",{"$f":"IFERROR(IF(OR(I427>0,H427=\"Enter Watts\"),I427*G427,H427*G427)-IF(OR(P427>0,O427=\"Enter Watts\"),P427*N427,O427*N427),\"\")","v":""},"",{"$f":"IF(AND(W427=\"\",Z427=\"\"),\"\",IF(OR(W427=\"\",Z427=\"\"),0,W427-Z427))","v":""},"",null,null,0,{"$nulls":3},"No"]
[null,409,{"$nulls":5},"",null,"",{"$nulls":4},"",null,"",null,"No",null,"",{"v":0,"d":"0.0000"},"",{"v":0,"d":"0.00"},{"$f":"IF(R428=\"Interior\",IF(AND(L428=\"\",E428=\"\"),\"\",IF(OR(P428>0,O428=\"Enter Watts\",P428=\"\"),P428*N428*(1-X428)/1000,O428*N428(1-X428)/1000)),IF(AND(E428=\"\",L428=\"\"),\"\",0))","v":""},"",{"$f":"IFERROR(IF(OR(I428>0,H428=\"Enter Watts\"),I428*G428,H428*G428)-IF(OR(P428>0,O428=\"Enter Watts\"),P428*N428,O428*N428),\"\")","v":""},"",{"$f":"IF(AND(W428=\"\",Z428=\"\"),\"\",IF(OR(W428=\"\",Z428=\"\"),0,W428-Z428))","v":""},"",null,null,0,{"$nulls":3},"No"]
[null,410,{"$nulls":5},"",null,"",{"$nulls":4},"",null,"",null,"No",null,"",{"v":0,"d":"0.0000"},"",{"v":0,"d":"0.00"},{"$f":"IF(R429=\"Interior\",IF(AND(L429=\"\",E429=\"\"),\"\",IF(OR(P429>0,O429=\"Enter Watts\",P429=\"\"),P429*N429*(1-X429)/1000,O429*N429(1-X429)/1000)),IF(AND(E429=\"\",L429=\"\"),\"\",0))","v":""},"","","","","",null,null,0,{"$nulls":3},"No"]
[null,411,{"$nulls":5},"",null,"",{"$nulls":4},"",null,"",null,"No",null,"",{"v":0,"d":"0.0000"},"",{"v":0,"d":"0.00"},{"$f":"IF(R430=\"Interior\",IF(AND(L430=\"\",E430=\"\"),\"\",IF(OR(P430>0,O430=\"Enter Watts\",P430=\"\"),P430*N430*(1-X430)/1000,O430*N430(1-X430)/1000)),IF(AND(E430=\"\",L430=\"\"),\"\",0))","v":""},"","","","","",null,null,0,{"$nulls":3},"No"]
[null,412,{"$nulls":5},"",null,"",{"$nulls":4},"",null,"",null,"No",null,"",{"v":0,"d":"0.0000"},"",{"v":0,"d":"0.00"},{"$f":"IF(R431=\"Interior\",IF(AND(L431=\"\",E431=\"\"),\"\",IF(OR(P431>0,O431=\"Enter Watts\",P431=\"\"),P431*N431*(1-X431)/1000,O431*N431(1-X431)/1000)),IF(AND(E431=\"\",L431=\"\"),\"\",0))","v":""},"","","","","",null,null,0,{"$nulls":3},"No",{"$nulls":6},"","",null,""]
[null,413,{"$nulls":5},"",null,"",{"$nulls":4},"",null,"",null,"No",null,"",{"v":0,"d":"0.0000"},"",{"v":0,"d":"0.00"},{"$f":"IF(R432=\"Interior\",IF(AND(L432=\"\",E432=\"\"),\"\",IF(OR(P432>0,O432=\"Enter Watts\",P432=\"\"),P432*N432*(1-X432)/1000,O432*N432(1-X432)/1000)),IF(AND(E432=\"\",L432=\"\"),\"\",0))","v":""},"","","","","",null,null,0,{"$nulls":3},"No"]
[null,414,{"$nulls":5},"",null,"",{"$nulls":4},"",null,"",null,"No",null,"",{"v":0,"d":"0.0000"},"",{"v":0,"d":"0.00"},{"$f":"IF(R433=\"Interior\",IF(AND(L433=\"\",E433=\"\"),\"\",IF(OR(P433>0,O433=\"Enter Watts\",P433=\"\"),P433*N433*(1-X433)/1000,O433*N433(1-X433)/1000)),IF(AND(E433=\"\",L433=\"\"),\"\",0))","v":""},"","","","","",null,null,0,{"$nulls":3},"No"]
[null,415,{"$nulls":5},"",null,"",{"$nulls":4},"",null,"",null,"No",null,"",{"v":0,"d":"0.0000"},"",{"v":0,"d":"0.00"},{"$f":"IF(R434=\"Interior\",IF(AND(L434=\"\",E434=\"\"),\"\",IF(OR(P434>0,O434=\"Enter Watts\",P434=\"\"),P434*N434*(1-X434)/1000,O434*N434(1-X434)/1000)),IF(AND(E434=\"\",L434=\"\"),\"\",0))","v":""},"","","","","",null,null,0,{"$nulls":3},"No"]
[null,416,{"$nulls":5},"",null,"",{"$nulls":4},"",null,"",null,"No",null,"",{"v":0,"d":"0.0000"},"",{"v":0,"d":"0.00"},{"$f":"IF(R435=\"Interior\",IF(AND(L435=\"\",E435=\"\"),\"\",IF(OR(P435>0,O435=\"Enter Watts\",P435=\"\"),P435*N435*(1-X435)/1000,O435*N435(1-X435)/1000)),IF(AND(E435=\"\",L435=\"\"),\"\",0))","v":""},"","","","","",null,null,0,{"$nulls":3},"No"]
[null,417,{"$nulls":5},"",null,"",{"$nulls":4},"",null,"",null,"No",null,"",{"v":0,"d":"0.0000"},"",{"v":0,"d":"0.00"},{"$f":"IF(R436=\"Interior\",IF(AND(L436=\"\",E436=\"\"),\"\",IF(OR(P436>0,O436=\"Enter Watts\",P436=\"\"),P436*N436*(1-X436)/1000,O436*N436(1-X436)/1000)),IF(AND(E436=\"\",L436=\"\"),\"\",0))","v":""},"","","","","",null,null,0,{"$nulls":3},"No"]
[null,418,{"$nulls":5},"",null,"",{"$nulls":4},"",null,"",null,"No",null,"",{"v":0,"d":"0.0000"},"",{"v":0,"d":"0.00"},{"$f":"IF(R437=\"Interior\",IF(AND(L437=\"\",E437=\"\"),\"\",IF(OR(P437>0,O437=\"Enter Watts\",P437=\"\"),P437*N437*(1-X437)/1000,O437*N437(1-X437)/1000)),IF(AND(E437=\"\",L437=\"\"),\"\",0))","v":""},"","","","","",null,null,0,{"$nulls":3},"No",{"$nulls":6},"","",null,""]
[null,419,{"$nulls":5},"",null,"",{"$nulls":4},"",null,"",null,"No",null,"",{"v":0,"d":"0.0000"},"",{"v":0,"d":"0.00"},{"$f":"IF(R438=\"Interior\",IF(AND(L438=\"\",E438=\"\"),\"\",IF(OR(P438>0,O438=\"Enter Watts\",P438=\"\"),P438*N438*(1-X438)/1000,O438*N438(1-X438)/1000)),IF(AND(E438=\"\",L438=\"\"),\"\",0))","v":""},"","","","","",null,null,0,{"$nulls":3},"No"]
[null,420,{"$nulls":5},"",null,"",{"$nulls":4},"",null,"",null,"No",null,"",{"v":0,"d":"0.0000"},"",{"v":0,"d":"0.00"},{"$f":"IF(R439=\"Interior\",IF(AND(L439=\"\",E439=\"\"),\"\",IF(OR(P439>0,O439=\"Enter Watts\",P439=\"\"),P439*N439*(1-X439)/1000,O439*N439(1-X439)/1000)),IF(AND(E439=\"\",L439=\"\"),\"\",0))","v":""},"","","","","",null,null,0,{"$nulls":3},"No"]
[null,421,{"$nulls":5},"",null,"",{"$nulls":4},"",null,"",null,"No",null,"",{"v":0,"d":"0.0000"},"",{"v":0,"d":"0.00"},{"$f":"IF(R440=\"Interior\",IF(AND(L440=\"\",E440=\"\"),\"\",IF(OR(P440>0,O440=\"Enter Watts\",P440=\"\"),P440*N440*(1-X440)/1000,O440*N440(1-X440)/1000)),IF(AND(E440=\"\",L440=\"\"),\"\",0))","v":""},"","","","","",null,null,0,{"$nulls":3},"No"]
[null,422,{"$nulls":5},"",null,"",{"$nulls":4},"",null,"",null,"No",null,"",{"v":0,"d":"0.0000"},"",{"v":0,"d":"0.00"},{"$f":"IF(R441=\"Interior\",IF(AND(L441=\"\",E441=\"\"),\"\",IF(OR(P441>0,O441=\"Enter Watts\",P441=\"\"),P441*N441*(1-X441)/1000,O441*N441(1-X441)/1000)),IF(AND(E441=\"\",L441=\"\"),\"\",0))","v":""},"","","","","",null,null,0,{"$nulls":3},"No"]
[null,423,{"$nulls":5},"",null,"",{"$nulls":4},"",null,"",null,"No",null,"",{"v":0,"d":"0.0000"},"",{"v":0,"d":"0.00"},{"$f":"IF(R442=\"Interior\",IF(AND(L442=\"\",E442=\"\"),\"\",IF(OR(P442>0,O442=\"Enter Watts\",P442=\"\"),P442*N442*(1-X442)/1000,O442*N442(1-X442)/1000)),IF(AND(E442=\"\",L442=\"\"),\"\",0))","v":""},"","","","","",null,null,0,{"$nulls":3},"No"]
[null,424,{"$nulls":5},"",null,"",{"$nulls":4},"",null,"",null,"No",null,"",{"v":0,"d":"0.0000"},"",{"v":0,"d":"0.00"},{"$f":"IF(R443=\"Interior\",IF(AND(L443=\"\",E443=\"\"),\"\",IF(OR(P443>0,O443=\"Enter Watts\",P443=\"\"),P443*N443*(1-X443)/1000,O443*N443(1-X443)/1000)),IF(AND(E443=\"\",L443=\"\"),\"\",0))","v":""},"","","","","",null,null,0,{"$nulls":3},"No"]
[null,425,{"$nulls":5},"",null,"",{"$nulls":4},"",null,"",null,"No",null,"",{"v":0,"d":"0.0000"},"",{"v":0,"d":"0.00"},{"$f":"IF(R444=\"Interior\",IF(AND(L444=\"\",E444=\"\"),\"\",IF(OR(P444>0,O444=\"Enter Watts\",P444=\"\"),P444*N444*(1-X444)/1000,O444*N444(1-X444)/1000)),IF(AND(E444=\"\",L444=\"\"),\"\",0))","v":""},"","","","","",null,null,0,{"$nulls":3},"No",{"$nulls":6},"","",null,""]
[null,426,{"$nulls":5},"",null,"",{"$nulls":4},"",null,"",null,"No",null,"",{"v":0,"d":"0.0000"},"",{"v":0,"d":"0.00"},{"$f":"IF(R445=\"Interior\",IF(AND(L445=\"\",E445=\"\"),\"\",IF(OR(P445>0,O445=\"Enter Watts\",P445=\"\"),P445*N445*(1-X445)/1000,O445*N445(1-X445)/1000)),IF(AND(E445=\"\",L445=\"\"),\"\",0))","v":""},"","","","","",null,null,0,{"$nulls":3},"No"]
[null,427,{"$nulls":5},"",null,"",{"$nulls":4},"",null,"",null,"No",null,"",{"v":0,"d":"0.0000"},"",{"v":0,"d":"0.00"},{"$f":"IF(R446=\"Interior\",IF(AND(L446=\"\",E446=\"\"),\"\",IF(OR(P446>0,O446=\"Enter Watts\",P446=\"\"),P446*N446*(1-X446)/1000,O446*N446(1-X446)/1000)),IF(AND(E446=\"\",L446=\"\"),\"\",0))","v":""},"","","","","",null,null,0,{"$nulls":3},"No"]
[null,428,{"$nulls":5},"",null,"",{"$nulls":4},"",null,"",null,"No",null,"",{"v":0,"d":"0.0000"},"",{"v":0,"d":"0.00"},{"$f":"IF(R447=\"Interior\",IF(AND(L447=\"\",E447=\"\"),\"\",IF(OR(P447>0,O447=\"Enter Watts\",P447=\"\"),P447*N447*(1-X447)/1000,O447*N447(1-X447)/1000)),IF(AND(E447=\"\",L447=\"\"),\"\",0))","v":""},"","","","","",null,null,0,{"$nulls":3},"No"]
[null,429,{"$nulls":5},"",null,"",{"$nulls":4},"",null,"",null,"No",null,"",{"v":0,"d":"0.0000"},"",{"v":0,"d":"0.00"},{"$f":"IF(R448=\"Interior\",IF(AND(L448=\"\",E448=\"\"),\"\",IF(OR(P448>0,O448=\"Enter Watts\",P448=\"\"),P448*N448*(1-X448)/1000,O448*N448(1-X448)/1000)),IF(AND(E448=\"\",L448=\"\"),\"\",0))","v":""},"","","","","",null,null,0,{"$nulls":3},"No"]
[null,430,{"$nulls":5},{"$f":"IF(E449=\"\",\"\",VLOOKUP(E449,$AQ$1114:$AR$1541,2,FALSE))","v":""},null,"",{"$nulls":4},"",null,"",null,"No",null,"",{"v":0,"d":"0.0000"},"",{"v":0,"d":"0.00"},{"$f":"IF(R449=\"Interior\",IF(AND(L449=\"\",E449=\"\"),\"\",IF(OR(P449>0,O449=\"Enter Watts\",P449=\"\"),P449*N449*(1-X449)/1000,O449*N449(1-X449)/1000)),IF(AND(E449=\"\",L449=\"\"),\"\",0))","v":""},"","","","",{"$f":"IF(AC449=\"\",\"\",IF(AND(R449=\"Interior\",S449=\"No\",OR(T449=\"\",T449=\"No\")),$J$1027,IF(AND(R449=\"Interior\",S449=\"Yes\"),$J$1028,IF(AND(R449=\"Exterior\",S449=\"Yes\"),$J$1029,IF(AND(R449=\"Exterior\",S449=\"No\",N449<>G449),\"DNQ\",\"See Lighting Catalog to determine Code\")))))","v":""},null,null,0,{"$nulls":3},"No"]
[null,431,{"$nulls":5},"",null,"",{"$nulls":4},"",null,"",null,"No",null,"",{"v":0,"d":"0.0000"},"",{"v":0,"d":"0.00"},{"$f":"IF(R450=\"Interior\",IF(AND(L450=\"\",E450=\"\"),\"\",IF(OR(P450>0,O450=\"Enter Watts\",P450=\"\"),P450*N450*(1-X450)/1000,O450*N450(1-X450)/1000)),IF(AND(E450=\"\",L450=\"\"),\"\",0))","v":""},"","","","","",null,null,0,{"$nulls":3},"No",{"$nulls":6},"","",null,""]
[null,432,{"$nulls":5},"",null,"",{"$nulls":4},"",null,"",null,"No",null,"",{"v":0,"d":"0.0000"},"",{"v":0,"d":"0.00"},{"$f":"IF(R451=\"Interior\",IF(AND(L451=\"\",E451=\"\"),\"\",IF(OR(P451>0,O451=\"Enter Watts\",P451=\"\"),P451*N451*(1-X451)/1000,O451*N451(1-X451)/1000)),IF(AND(E451=\"\",L451=\"\"),\"\",0))","v":""},"","","","","",null,null,0,{"$nulls":3},"No"]
[null,433,{"$nulls":5},"",null,"",{"$nulls":4},"",null,"",null,"No",null,"",{"v":0,"d":"0.0000"},"",{"v":0,"d":"0.00"},{"$f":"IF(R452=\"Interior\",IF(AND(L452=\"\",E452=\"\"),\"\",IF(OR(P452>0,O452=\"Enter Watts\",P452=\"\"),P452*N452*(1-X452)/1000,O452*N452(1-X452)/1000)),IF(AND(E452=\"\",L452=\"\"),\"\",0))","v":""},"","","","","",null,null,0,{"$nulls":3},"No"]
[null,434,{"$nulls":5},"",null,"",{"$nulls":4},"",null,"",null,"No",null,"",{"v":0,"d":"0.0000"},"",{"v":0,"d":"0.00"},{"$f":"IF(R453=\"Interior\",IF(AND(L453=\"\",E453=\"\"),\"\",IF(OR(P453>0,O453=\"Enter Watts\",P453=\"\"),P453*N453*(1-X453)/1000,O453*N453(1-X453)/1000)),IF(AND(E453=\"\",L453=\"\"),\"\",0))","v":""},"","","","","",null,null,0,{"$nulls":3},"No"]
[null,435,{"$nulls":5},"",null,"",{"$nulls":4},"",null,"",null,"No",null,"",{"v":0,"d":"0.0000"},"",{"v":0,"d":"0.00"},{"$f":"IF(R454=\"Interior\",IF(AND(L454=\"\",E454=\"\"),\"\",IF(OR(P454>0,O454=\"Enter Watts\",P454=\"\"),P454*N454*(1-X454)/1000,O454*N454(1-X454)/1000)),IF(AND(E454=\"\",L454=\"\"),\"\",0))","v":""},"","","","","",null,null,0,{"$nulls":3},"No"]
[null,436,{"$nulls":5},"",null,"",{"$nulls":4},"",null,"",null,"No",null,"",{"v":0,"d":"0.0000"},"",{"v":0,"d":"0.00"},{"$f":"IF(R455=\"Interior\",IF(AND(L455=\"\",E455=\"\"),\"\",IF(OR(P455>0,O455=\"Enter Watts\",P455=\"\"),P455*N455*(1-X455)/1000,O455*N455(1-X455)/1000)),IF(AND(E455=\"\",L455=\"\"),\"\",0))","v":""},"","","","","",null,null,0,{"$nulls":3},"No"]
[null,437,{"$nulls":5},"",null,"",{"$nulls":4},"",null,"",null,"No",null,"",{"v":0,"d":"0.0000"},"",{"v":0,"d":"0.00"},{"$f":"IF(R456=\"Interior\",IF(AND(L456=\"\",E456=\"\"),\"\",IF(OR(P456>0,O456=\"Enter Watts\",P456=\"\"),P456*N456*(1-X456)/1000,O456*N456(1-X456)/1000)),IF(AND(E456=\"\",L456=\"\"),\"\",0))","v":""},"","","","","",null,null,0,{"$nulls":3},"No"]
[null,438,{"$nulls":5},"",null,"",{"$nulls":4},"",null,"",null,"No",null,"",{"v":0,"d":"0.0000"},"",{"v":0,"d":"0.00"},{"$f":"IF(R457=\"Interior\",IF(AND(L457=\"\",E457=\"\"),\"\",IF(OR(P457>0,O457=\"Enter Watts\",P457=\"\"),P457*N457*(1-X457)/1000,O457*N457(1-X457)/1000)),IF(AND(E457=\"\",L457=\"\"),\"\",0))","v":""},"","","","","",null,null,0,{"$nulls":3},"No"]
[null,439,{"$nulls":5},"",null,"",{"$nulls":4},"",null,"",null,"No",null,"",{"v":0,"d":"0.0000"},"",{"v":0,"d":"0.00"},{"$f":"IF(R458=\"Interior\",IF(AND(L458=\"\",E458=\"\"),\"\",IF(OR(P458>0,O458=\"Enter Watts\",P458=\"\"),P458*N458*(1-X458)/1000,O458*N458(1-X458)/1000)),IF(AND(E458=\"\",L458=\"\"),\"\",0))","v":""},"","","","","",null,null,0,{"$nulls":3},"No"]
[null,440,{"$nulls":5},"",null,"",{"$nulls":4},"",null,"",null,"No",null,"",{"v":0,"d":"0.0000"},"",{"v":0,"d":"0.00"},{"$f":"IF(R459=\"Interior\",IF(AND(L459=\"\",E459=\"\"),\"\",IF(OR(P459>0,O459=\"Enter Watts\",P459=\"\"),P459*N459*(1-X459)/1000,O459*N459(1-X459)/1000)),IF(AND(E459=\"\",L459=\"\"),\"\",0))","v":""},"","","","","",null,null,0,{"$nulls":3},"No"]
[null,441,{"$nulls":5},"",null,"",{"$nulls":4},"",null,"",null,"No",null,"",{"v":0,"d":"0.0000"},"",{"v":0,"d":"0.00"},{"$f":"IF(R460=\"Interior\",IF(AND(L460=\"\",E460=\"\"),\"\",IF(OR(P460>0,O460=\"Enter Watts\",P460=\"\"),P460*N460*(1-X460)/1000,O460*N460(1-X460)/1000)),IF(AND(E460=\"\",L460=\"\"),\"\",0))","v":""},"","","","","",null,null,0,{"$nulls":3},"No"]
[null,442,{"$nulls":5},"",null,"",{"$nulls":4},"",null,"",null,"No",null,"",{"v":0,"d":"0.0000"},"",{"v":0,"d":"0.00"},{"$f":"IF(R461=\"Interior\",IF(AND(L461=\"\",E461=\"\"),\"\",IF(OR(P461>0,O461=\"Enter Watts\",P461=\"\"),P461*N461*(1-X461)/1000,O461*N461(1-X461)/1000)),IF(AND(E461=\"\",L461=\"\"),\"\",0))","v":""},"","","","","",null,null,0,{"$nulls":3},"No"]
[null,443,{"$nulls":5},"",null,"",{"$nulls":4},"",null,"",null,"No",null,"",{"v":0,"d":"0.0000"},"",{"v":0,"d":"0.00"},{"$f":"IF(R462=\"Interior\",IF(AND(L462=\"\",E462=\"\"),\"\",IF(OR(P462>0,O462=\"Enter Watts\",P462=\"\"),P462*N462*(1-X462)/1000,O462*N462(1-X462)/1000)),IF(AND(E462=\"\",L462=\"\"),\"\",0))","v":""},"","","","","",null,null,0,{"$nulls":3},"No",{"$nulls":6},"","",null,""]
[null,444,{"$nulls":5},"",null,"",{"$nulls":4},"",null,"",null,"No",null,"",{"v":0,"d":"0.0000"},"",{"v":0,"d":"0.00"},{"$f":"IF(R463=\"Interior\",IF(AND(L463=\"\",E463=\"\"),\"\",IF(OR(P463>0,O463=\"Enter Watts\",P463=\"\"),P463*N463*(1-X463)/1000,O463*N463(1-X463)/1000)),IF(AND(E463=\"\",L463=\"\"),\"\",0))","v":""},"","","","","",null,null,0,{"$nulls":3},"No"]
[null,445,{"$nulls":5},"",null,"",{"$nulls":4},"",null,"",null,"No",null,"",{"v":0,"d":"0.0000"},"",{"v":0,"d":"0.00"},{"$f":"IF(R464=\"Interior\",IF(AND(L464=\"\",E464=\"\"),\"\",IF(OR(P464>0,O464=\"Enter Watts\",P464=\"\"),P464*N464*(1-X464)/1000,O464*N464(1-X464)/1000)),IF(AND(E464=\"\",L464=\"\"),\"\",0))","v":""},"","","","","",null,null,0,{"$nulls":3},"No"]
[null,446,{"$nulls":5},"",null,"",{"$nulls":4},"",null,"",null,"No",null,"",{"v":0,"d":"0.0000"},"",{"v":0,"d":"0.00"},{"$f":"IF(R465=\"Interior\",IF(AND(L465=\"\",E465=\"\"),\"\",IF(OR(P465>0,O465=\"Enter Watts\",P465=\"\"),P465*N465*(1-X465)/1000,O465*N465(1-X465)/1000)),IF(AND(E465=\"\",L465=\"\"),\"\",0))","v":""},"","","","","",null,null,0,{"$nulls":3},"No"]
[null,447,{"$nulls":5},"",null,"",{"$nulls":4},"",null,"",null,"No",null,"",{"v":0,"d":"0.0000"},"",{"v":0,"d":"0.00"},{"$f":"IF(R466=\"Interior\",IF(AND(L466=\"\",E466=\"\"),\"\",IF(OR(P466>0,O466=\"Enter Watts\",P466=\"\"),P466*N466*(1-X466)/1000,O466*N466(1-X466)/1000)),IF(AND(E466=\"\",L466=\"\"),\"\",0))","v":""},"","","","","",null,null,0,{"$nulls":3},"No"]
[null,448,{"$nulls":5},"",null,"",{"$nulls":4},"",null,"",null,"No",null,"",{"v":0,"d":"0.0000"},"",{"v":0,"d":"0.00"},{"$f":"IF(R467=\"Interior\",IF(AND(L467=\"\",E467=\"\"),\"\",IF(OR(P467>0,O467=\"Enter Watts\",P467=\"\"),P467*N467*(1-X467)/1000,O467*N467(1-X467)/1000)),IF(AND(E467=\"\",L467=\"\"),\"\",0))","v":""},"","","","","",null,null,0,{"$nulls":3},"No"]
[null,449,{"$nulls":5},"",null,{"$f":"IF(AND(E468<>\"\",G468<>\"\",$E$8=\"Default Sector Hours\"),VLOOKUP(IF(R468=\"Exterior\",\"Exterior\",$E$7),$W$1036:$X$1041,2,FALSE),\"\")","v":""},{"$nulls":4},{"$f":"IF(L468=\"\",\"\",VLOOKUP(L468,$AQ$1113:$AR$1541,2,FALSE))","v":""},null,"",null,"No",null,"",{"v":0,"d":"0.0000"},"",{"v":0,"d":"0.00"},{"$f":"IF(R468=\"Interior\",IF(AND(L468=\"\",E468=\"\"),\"\",IF(OR(P468>0,O468=\"Enter Watts\",P468=\"\"),P468*N468*(1-X468)/1000,O468*N468(1-X468)/1000)),IF(AND(E468=\"\",L468=\"\"),\"\",0))","v":""},{"$f":"IFERROR(IF(AND(L468=\"\", E468=\"\"),\"\",N468/1000*IF(OR(P468>0,O468=\"Enter Watts\"),P468,O468)*IF(R468=\"Exterior\",$X$1041,IF($E$8=\"Manual Input\",Q468,VLOOKUP($E$7,$W$1036:$Z$1040,2,FALSE)))*IF(S468=\"Yes\",IF(R468=\"Exterior\",1-$Z$1041,1-VLOOKUP($E$7,$W$1036:$Z$1040,4,FALSE)),1)),0)","v":""},"",{"$f":"IF(AND(U468=\"\",Y468=\"\"),\"\",IF(OR(U468=\"\",Y468=\"\"),0,  IF($E$8=\"Manual Input\",$G$9,   VLOOKUP($E$7,$W$1036:$Z$1041,3,FALSE))     *(U468-Y468)))","v":""},"","",null,null,0,{"$nulls":3},"No",{"$nulls":6},"","",null,""]
[null,450,{"$nulls":5},"",null,"",{"$nulls":4},"",null,"",null,"No",null,{"$f":"IF(V469=\"Int Control\",IF(E469=\"\",\"\",IF(OR(I469>0,H469=\"Enter Watts\"),I469*G469/1000*(1-$E$15),H469*G469/1000*(1-$E$15))),IF(E469=\"\",\"\",IF(OR(I469>0,H469=\"Enter Watts\"),I469*G469/1000,H469*G469/1000)))","v":""},{"$f":"IF(AND(R469=\"Interior\",S469=\"Yes\"),\"Int Control\",0)","v":{"v":0,"d":"0.0000"}},{"$f":"IFERROR(IF(V469=\"Int Control\",IF(E469=\"\",\"\",G469/1000*(1-$E$15)*IF(OR(I469>0,H469=\"Enter Watts\"),I469,H469)*IF(R469=\"Exterior\",$X$1041*(1-$G$15),IF($E$8=\"Manual Input\",J469,VLOOKUP($E$7,$W$1036:$Z$1040,2,FALSE)*(1-$E$15)))),IF(E469=\"\",\"\",G469/1000*IF(OR(I469>0,H469=\"Enter Watts\"),I469,H469)*IF(R469=\"Exterior\",$X$1041,IF($E$8=\"Manual Input\",J469,VLOOKUP($E$7,$W$1036:$Z$1040,2,FALSE))))),\"0\")","v":""},{"$f":"IF(S469=\"No\",0,AA$1036)","v":{"v":0,"d":"0.00"}},{"$f":"IF(R469=\"Interior\",IF(AND(L469=\"\",E469=\"\"),\"\",IF(OR(P469>0,O469=\"Enter Watts\",P469=\"\"),P469*N469*(1-X469)/1000,O469*N469(1-X469)/1000)),IF(AND(E469=\"\",L469=\"\"),\"\",0))","v":""},"","","","","",null,null,{"$f":"AF469*N469","v":0},{"$nulls":3},{"$f":"IF(_xlfn.ISFORMULA(J469)=TRUE,\"No\",\"Yes\")","v":"No"}]
[null,451,{"$nulls":5},"",null,"",{"$nulls":4},"",null,"",null,"No",null,"",{"v":0,"d":"0.0000"},"",{"v":0,"d":"0.00"},{"$f":"IF(R470=\"Interior\",IF(AND(L470=\"\",E470=\"\"),\"\",IF(OR(P470>0,O470=\"Enter Watts\",P470=\"\"),P470*N470*(1-X470)/1000,O470*N470(1-X470)/1000)),IF(AND(E470=\"\",L470=\"\"),\"\",0))","v":""},"","","","","",null,null,0,{"$nulls":3},"No"]
[null,452,{"$nulls":5},"",null,"",{"$nulls":4},"",null,"",null,"No",null,"",{"v":0,"d":"0.0000"},"",{"v":0,"d":"0.00"},{"$f":"IF(R471=\"Interior\",IF(AND(L471=\"\",E471=\"\"),\"\",IF(OR(P471>0,O471=\"Enter Watts\",P471=\"\"),P471*N471*(1-X471)/1000,O471*N471(1-X471)/1000)),IF(AND(E471=\"\",L471=\"\"),\"\",0))","v":""},"","","","","",null,null,0,{"$nulls":3},"No"]
[null,453,{"$nulls":5},"",null,"",{"$nulls":4},"",null,"",null,"No",null,"",{"v":0,"d":"0.0000"},"",{"v":0,"d":"0.00"},{"$f":"IF(R472=\"Interior\",IF(AND(L472=\"\",E472=\"\"),\"\",IF(OR(P472>0,O472=\"Enter Watts\",P472=\"\"),P472*N472*(1-X472)/1000,O472*N472(1-X472)/1000)),IF(AND(E472=\"\",L472=\"\"),\"\",0))","v":""},"","","","","",null,null,0,{"$nulls":3},"No"]
[null,454,{"$nulls":5},"",null,"",{"$nulls":4},"",null,"",null,"No",null,"",{"v":0,"d":"0.0000"},"",{"v":0,"d":"0.00"},{"$f":"IF(R473=\"Interior\",IF(AND(L473=\"\",E473=\"\"),\"\",IF(OR(P473>0,O473=\"Enter Watts\",P473=\"\"),P473*N473*(1-X473)/1000,O473*N473(1-X473)/1000)),IF(AND(E473=\"\",L473=\"\"),\"\",0))","v":""},"","","","","",null,null,0,{"$nulls":3},"No"]
[null,455,{"$nulls":5},"",null,"",{"$nulls":4},"",null,"",null,"No",null,"",{"v":0,"d":"0.0000"},"",{"v":0,"d":"0.00"},{"$f":"IF(R474=\"Interior\",IF(AND(L474=\"\",E474=\"\"),\"\",IF(OR(P474>0,O474=\"Enter Watts\",P474=\"\"),P474*N474*(1-X474)/1000,O474*N474(1-X474)/1000)),IF(AND(E474=\"\",L474=\"\"),\"\",0))","v":""},"","","","","",null,null,0,{"$nulls":3},"No"]
[null,456,{"$nulls":5},"",null,"",{"$nulls":4},"",null,"",null,"No",null,"",{"v":0,"d":"0.0000"},"",{"v":0,"d":"0.00"},{"$f":"IF(R475=\"Interior\",IF(AND(L475=\"\",E475=\"\"),\"\",IF(OR(P475>0,O475=\"Enter Watts\",P475=\"\"),P475*N475*(1-X475)/1000,O475*N475(1-X475)/1000)),IF(AND(E475=\"\",L475=\"\"),\"\",0))","v":""},"",{"$f":"IFERROR(IF(OR(I475>0,H475=\"Enter Watts\"),I475*G475,H475*G475)-IF(OR(P475>0,O475=\"Enter Watts\"),P475*N475,O475*N475),\"\")","v":""},"",{"$f":"IF(AND(W475=\"\",Z475=\"\"),\"\",IF(OR(W475=\"\",Z475=\"\"),0,W475-Z475))","v":""},"",null,null,0,{"$nulls":3},"No"]
[null,457,{"$nulls":5},"",null,"",{"$nulls":4},"",null,"",null,"No",null,"",{"v":0,"d":"0.0000"},"",{"v":0,"d":"0.00"},{"$f":"IF(R476=\"Interior\",IF(AND(L476=\"\",E476=\"\"),\"\",IF(OR(P476>0,O476=\"Enter Watts\",P476=\"\"),P476*N476*(1-X476)/1000,O476*N476(1-X476)/1000)),IF(AND(E476=\"\",L476=\"\"),\"\",0))","v":""},"",{"$f":"IFERROR(IF(OR(I476>0,H476=\"Enter Watts\"),I476*G476,H476*G476)-IF(OR(P476>0,O476=\"Enter Watts\"),P476*N476,O476*N476),\"\")","v":""},"",{"$f":"IF(AND(W476=\"\",Z476=\"\"),\"\",IF(OR(W476=\"\",Z476=\"\"),0,W476-Z476))","v":""},"",null,null,0,{"$nulls":3},"No"]
[null,458,{"$nulls":5},"",null,"",{"$nulls":4},"",null,"",null,"No",null,"",{"v":0,"d":"0.0000"},"",{"v":0,"d":"0.00"},{"$f":"IF(R477=\"Interior\",IF(AND(L477=\"\",E477=\"\"),\"\",IF(OR(P477>0,O477=\"Enter Watts\",P477=\"\"),P477*N477*(1-X477)/1000,O477*N477(1-X477)/1000)),IF(AND(E477=\"\",L477=\"\"),\"\",0))","v":""},"","","","","",null,null,0,{"$nulls":3},"No"]
[null,459,{"$nulls":5},"",null,"",{"$nulls":4},"",null,"",null,"No",null,"",{"v":0,"d":"0.0000"},"",{"v":0,"d":"0.00"},{"$f":"IF(R478=\"Interior\",IF(AND(L478=\"\",E478=\"\"),\"\",IF(OR(P478>0,O478=\"Enter Watts\",P478=\"\"),P478*N478*(1-X478)/1000,O478*N478(1-X478)/1000)),IF(AND(E478=\"\",L478=\"\"),\"\",0))","v":""},"","","","","",null,null,0,{"$nulls":3},"No"]
[null,460,{"$nulls":5},"",null,"",{"$nulls":4},"",null,"",null,"No",null,"",{"v":0,"d":"0.0000"},"",{"v":0,"d":"0.00"},{"$f":"IF(R479=\"Interior\",IF(AND(L479=\"\",E479=\"\"),\"\",IF(OR(P479>0,O479=\"Enter Watts\",P479=\"\"),P479*N479*(1-X479)/1000,O479*N479(1-X479)/1000)),IF(AND(E479=\"\",L479=\"\"),\"\",0))","v":""},"","","","","",null,null,0,{"$nulls":3},"No",{"$nulls":6},"","",null,""]
[null,461,{"$nulls":5},"",null,"",{"$nulls":4},"",null,"",null,"No",null,"",{"v":0,"d":"0.0000"},"",{"v":0,"d":"0.00"},{"$f":"IF(R480=\"Interior\",IF(AND(L480=\"\",E480=\"\"),\"\",IF(OR(P480>0,O480=\"Enter Watts\",P480=\"\"),P480*N480*(1-X480)/1000,O480*N480(1-X480)/1000)),IF(AND(E480=\"\",L480=\"\"),\"\",0))","v":""},"","","","","",null,null,0,{"$nulls":3},"No"]
[null,462,{"$nulls":5},"",null,"",{"$nulls":4},"",null,"",null,"No",null,"",{"v":0,"d":"0.0000"},"",{"v":0,"d":"0.00"},{"$f":"IF(R481=\"Interior\",IF(AND(L481=\"\",E481=\"\"),\"\",IF(OR(P481>0,O481=\"Enter Watts\",P481=\"\"),P481*N481*(1-X481)/1000,O481*N481(1-X481)/1000)),IF(AND(E481=\"\",L481=\"\"),\"\",0))","v":""},"","","","","",null,null,0,{"$nulls":3},"No"]
[null,463,{"$nulls":5},"",null,"",{"$nulls":4},"",null,"",null,"No",null,"",{"v":0,"d":"0.0000"},"",{"v":0,"d":"0.00"},{"$f":"IF(R482=\"Interior\",IF(AND(L482=\"\",E482=\"\"),\"\",IF(OR(P482>0,O482=\"Enter Watts\",P482=\"\"),P482*N482*(1-X482)/1000,O482*N482(1-X482)/1000)),IF(AND(E482=\"\",L482=\"\"),\"\",0))","v":""},"","","","","",null,null,0,{"$nulls":3},"No"]
[null,464,{"$nulls":5},"",null,"",{"$nulls":4},"",null,"",null,"No",null,"",{"v":0,"d":"0.0000"},"",{"v":0,"d":"0.00"},{"$f":"IF(R483=\"Interior\",IF(AND(L483=\"\",E483=\"\"),\"\",IF(OR(P483>0,O483=\"Enter Watts\",P483=\"\"),P483*N483*(1-X483)/1000,O483*N483(1-X483)/1000)),IF(AND(E483=\"\",L483=\"\"),\"\",0))","v":""},"","","","","",null,null,0,{"$nulls":3},"No"]
[null,465,{"$nulls":5},"",null,"",{"$nulls":4},"",null,"",null,"No",null,"",{"v":0,"d":"0.0000"},"",{"v":0,"d":"0.00"},{"$f":"IF(R484=\"Interior\",IF(AND(L484=\"\",E484=\"\"),\"\",IF(OR(P484>0,O484=\"Enter Watts\",P484=\"\"),P484*N484*(1-X484)/1000,O484*N484(1-X484)/1000)),IF(AND(E484=\"\",L484=\"\"),\"\",0))","v":""},"","","","","",null,null,0,{"$nulls":3},"No"]
[null,466,{"$nulls":5},"",null,"",{"$nulls":4},"",null,"",null,"No",null,"",{"v":0,"d":"0.0000"},"",{"v":0,"d":"0.00"},{"$f":"IF(R485=\"Interior\",IF(AND(L485=\"\",E485=\"\"),\"\",IF(OR(P485>0,O485=\"Enter Watts\",P485=\"\"),P485*N485*(1-X485)/1000,O485*N485(1-X485)/1000)),IF(AND(E485=\"\",L485=\"\"),\"\",0))","v":""},"","","","","",null,null,0,{"$nulls":3},"No",{"$nulls":6},"","",null,""]
[null,467,{"$nulls":5},"",null,"",{"$nulls":4},"",null,"",null,"No",null,"",{"v":0,"d":"0.0000"},"",{"v":0,"d":"0.00"},{"$f":"IF(R486=\"Interior\",IF(AND(L486=\"\",E486=\"\"),\"\",IF(OR(P486>0,O486=\"Enter Watts\",P486=\"\"),P486*N486*(1-X486)/1000,O486*N486(1-X486)/1000)),IF(AND(E486=\"\",L486=\"\"),\"\",0))","v":""},"","","","","",null,null,0,{"$nulls":3},"No"]
[null,468,{"$nulls":5},"",null,"",{"$nulls":4},"",null,"",null,"No",null,"",{"v":0,"d":"0.0000"},"",{"v":0,"d":"0.00"},{"$f":"IF(R487=\"Interior\",IF(AND(L487=\"\",E487=\"\"),\"\",IF(OR(P487>0,O487=\"Enter Watts\",P487=\"\"),P487*N487*(1-X487)/1000,O487*N487(1-X487)/1000)),IF(AND(E487=\"\",L487=\"\"),\"\",0))","v":""},"","","","","",null,null,0,{"$nulls":3},"No"]
[null,469,{"$nulls":5},"",null,"",{"$nulls":4},"",null,"",null,"No",null,"",{"v":0,"d":"0.0000"},"",{"v":0,"d":"0.00"},{"$f":"IF(R488=\"Interior\",IF(AND(L488=\"\",E488=\"\"),\"\",IF(OR(P488>0,O488=\"Enter Watts\",P488=\"\"),P488*N488*(1-X488)/1000,O488*N488(1-X488)/1000)),IF(AND(E488=\"\",L488=\"\"),\"\",0))","v":""},"","","","","",null,null,0,{"$nulls":3},"No"]
[null,470,{"$nulls":5},"",null,"",{"$nulls":4},"",null,"",null,"No",null,"",{"v":0,"d":"0.0000"},"",{"v":0,"d":"0.00"},{"$f":"IF(R489=\"Interior\",IF(AND(L489=\"\",E489=\"\"),\"\",IF(OR(P489>0,O489=\"Enter Watts\",P489=\"\"),P489*N489*(1-X489)/1000,O489*N489(1-X489)/1000)),IF(AND(E489=\"\",L489=\"\"),\"\",0))","v":""},"","","","","",null,null,0,{"$nulls":3},"No"]
[null,471,{"$nulls":5},"",null,"",{"$nulls":4},"",null,"",null,"No",null,"",{"v":0,"d":"0.0000"},"",{"v":0,"d":"0.00"},{"$f":"IF(R490=\"Interior\",IF(AND(L490=\"\",E490=\"\"),\"\",IF(OR(P490>0,O490=\"Enter Watts\",P490=\"\"),P490*N490*(1-X490)/1000,O490*N490(1-X490)/1000)),IF(AND(E490=\"\",L490=\"\"),\"\",0))","v":""},"","","","","",null,null,0,{"$nulls":3},"No"]
[null,472,{"$nulls":5},"",null,"",{"$nulls":4},"",null,"",null,"No",null,"",{"v":0,"d":"0.0000"},"",{"v":0,"d":"0.00"},{"$f":"IF(R491=\"Interior\",IF(AND(L491=\"\",E491=\"\"),\"\",IF(OR(P491>0,O491=\"Enter Watts\",P491=\"\"),P491*N491*(1-X491)/1000,O491*N491(1-X491)/1000)),IF(AND(E491=\"\",L491=\"\"),\"\",0))","v":""},"","","","","",null,null,0,{"$nulls":3},"No"]
[null,473,{"$nulls":5},"",null,"",{"$nulls":4},"",null,"",null,"No",null,"",{"v":0,"d":"0.0000"},"",{"v":0,"d":"0.00"},{"$f":"IF(R492=\"Interior\",IF(AND(L492=\"\",E492=\"\"),\"\",IF(OR(P492>0,O492=\"Enter Watts\",P492=\"\"),P492*N492*(1-X492)/1000,O492*N492(1-X492)/1000)),IF(AND(E492=\"\",L492=\"\"),\"\",0))","v":""},"","","","","",null,null,0,{"$nulls":3},"No",{"$nulls":6},"","",null,""]
[null,474,{"$nulls":5},"",null,"",{"$nulls":4},"",null,"",null,"No",null,"",{"v":0,"d":"0.0000"},"",{"v":0,"d":"0.00"},{"$f":"IF(R493=\"Interior\",IF(AND(L493=\"\",E493=\"\"),\"\",IF(OR(P493>0,O493=\"Enter Watts\",P493=\"\"),P493*N493*(1-X493)/1000,O493*N493(1-X493)/1000)),IF(AND(E493=\"\",L493=\"\"),\"\",0))","v":""},"","","","","",null,null,0,{"$nulls":3},"No"]
[null,475,{"$nulls":5},"",null,"",{"$nulls":4},"",null,"",null,"No",null,"",{"v":0,"d":"0.0000"},"",{"v":0,"d":"0.00"},{"$f":"IF(R494=\"Interior\",IF(AND(L494=\"\",E494=\"\"),\"\",IF(OR(P494>0,O494=\"Enter Watts\",P494=\"\"),P494*N494*(1-X494)/1000,O494*N494(1-X494)/1000)),IF(AND(E494=\"\",L494=\"\"),\"\",0))","v":""},"","","","","",null,null,0,{"$nulls":3},"No"]
[null,476,{"$nulls":5},"",null,"",{"$nulls":4},"",null,"",null,"No",null,"",{"v":0,"d":"0.0000"},"",{"v":0,"d":"0.00"},{"$f":"IF(R495=\"Interior\",IF(AND(L495=\"\",E495=\"\"),\"\",IF(OR(P495>0,O495=\"Enter Watts\",P495=\"\"),P495*N495*(1-X495)/1000,O495*N495(1-X495)/1000)),IF(AND(E495=\"\",L495=\"\"),\"\",0))","v":""},"","","","","",null,null,0,{"$nulls":3},"No"]
[null,477,{"$nulls":5},"",null,"",{"$nulls":4},"",null,"",null,"No",null,"",{"v":0,"d":"0.0000"},"",{"v":0,"d":"0.00"},{"$f":"IF(R496=\"Interior\",IF(AND(L496=\"\",E496=\"\"),\"\",IF(OR(P496>0,O496=\"Enter Watts\",P496=\"\"),P496*N496*(1-X496)/1000,O496*N496(1-X496)/1000)),IF(AND(E496=\"\",L496=\"\"),\"\",0))","v":""},"","","","","",null,null,0,{"$nulls":3},"No"]
[null,478,{"$nulls":5},"",null,"",{"$nulls":4},"",null,"",null,"No",null,"",{"v":0,"d":"0.0000"},"",{"v":0,"d":"0.00"},{"$f":"IF(R497=\"Interior\",IF(AND(L497=\"\",E497=\"\"),\"\",IF(OR(P497>0,O497=\"Enter Watts\",P497=\"\"),P497*N497*(1-X497)/1000,O497*N497(1-X497)/1000)),IF(AND(E497=\"\",L497=\"\"),\"\",0))","v":""},"","","","","",null,null,0,{"$nulls":3},"No"]
[null,479,{"$nulls":5},"",null,"",{"$nulls":4},"",null,"",null,"No",null,"",{"v":0,"d":"0.0000"},"",{"v":0,"d":"0.00"},{"$f":"IF(R498=\"Interior\",IF(AND(L498=\"\",E498=\"\"),\"\",IF(OR(P498>0,O498=\"Enter Watts\",P498=\"\"),P498*N498*(1-X498)/1000,O498*N498(1-X498)/1000)),IF(AND(E498=\"\",L498=\"\"),\"\",0))","v":""},"","","","","",null,null,0,{"$nulls":3},"No",{"$nulls":6},"","",null,""]
[null,480,{"$nulls":5},"",null,"",{"$nulls":4},"",null,"",null,"No",null,"",{"v":0,"d":"0.0000"},"",{"v":0,"d":"0.00"},{"$f":"IF(R499=\"Interior\",IF(AND(L499=\"\",E499=\"\"),\"\",IF(OR(P499>0,O499=\"Enter Watts\",P499=\"\"),P499*N499*(1-X499)/1000,O499*N499(1-X499)/1000)),IF(AND(E499=\"\",L499=\"\"),\"\",0))","v":""},"","","","","",null,null,0,{"$nulls":3},"No"]
[null,481,{"$nulls":5},"",null,"",{"$nulls":4},"",null,"",null,"No",null,"",{"v":0,"d":"0.0000"},"",{"v":0,"d":"0.00"},{"$f":"IF(R500=\"Interior\",IF(AND(L500=\"\",E500=\"\"),\"\",IF(OR(P500>0,O500=\"Enter Watts\",P500=\"\"),P500*N500*(1-X500)/1000,O500*N500(1-X500)/1000)),IF(AND(E500=\"\",L500=\"\"),\"\",0))","v":""},"","","","","",null,null,0,{"$nulls":3},"No"]
[null,482,{"$nulls":5},"",null,"",{"$nulls":4},"",null,"",null,"No",null,"",{"v":0,"d":"0.0000"},"",{"v":0,"d":"0.00"},{"$f":"IF(R501=\"Interior\",IF(AND(L501=\"\",E501=\"\"),\"\",IF(OR(P501>0,O501=\"Enter Watts\",P501=\"\"),P501*N501*(1-X501)/1000,O501*N501(1-X501)/1000)),IF(AND(E501=\"\",L501=\"\"),\"\",0))","v":""},"","","","","",null,null,0,{"$nulls":3},"No"]
[null,483,{"$nulls":5},"",null,"",{"$nulls":4},"",null,"",null,"No",null,"",{"v":0,"d":"0.0000"},"",{"v":0,"d":"0.00"},{"$f":"IF(R502=\"Interior\",IF(AND(L502=\"\",E502=\"\"),\"\",IF(OR(P502>0,O502=\"Enter Watts\",P502=\"\"),P502*N502*(1-X502)/1000,O502*N502(1-X502)/1000)),IF(AND(E502=\"\",L502=\"\"),\"\",0))","v":""},"","","","","",null,null,0,{"$nulls":3},"No"]
[null,484,{"$nulls":5},"",null,"",{"$nulls":4},"",null,"",null,"No",null,"",{"v":0,"d":"0.0000"},"",{"v":0,"d":"0.00"},{"$f":"IF(R503=\"Interior\",IF(AND(L503=\"\",E503=\"\"),\"\",IF(OR(P503>0,O503=\"Enter Watts\",P503=\"\"),P503*N503*(1-X503)/1000,O503*N503(1-X503)/1000)),IF(AND(E503=\"\",L503=\"\"),\"\",0))","v":""},"","","","","",null,null,0,{"$nulls":3},"No"]
[null,485,{"$nulls":5},"",null,"",{"$nulls":4},"",null,"",null,"No",null,"",{"v":0,"d":"0.0000"},"",{"v":0,"d":"0.00"},{"$f":"IF(R504=\"Interior\",IF(AND(L504=\"\",E504=\"\"),\"\",IF(OR(P504>0,O504=\"Enter Watts\",P504=\"\"),P504*N504*(1-X504)/1000,O504*N504(1-X504)/1000)),IF(AND(E504=\"\",L504=\"\"),\"\",0))","v":""},"","","","","",null,null,0,{"$nulls":3},"No"]
[null,486,{"$nulls":5},"",null,"",{"$nulls":4},"",null,"",null,"No",null,"",{"v":0,"d":"0.0000"},"",{"v":0,"d":"0.00"},{"$f":"IF(R505=\"Interior\",IF(AND(L505=\"\",E505=\"\"),\"\",IF(OR(P505>0,O505=\"Enter Watts\",P505=\"\"),P505*N505*(1-X505)/1000,O505*N505(1-X505)/1000)),IF(AND(E505=\"\",L505=\"\"),\"\",0))","v":""},"","","","","",null,null,0,{"$nulls":3},"No"]
[null,487,{"$nulls":5},"",null,"",{"$nulls":4},"",null,"",null,"No",null,"",{"v":0,"d":"0.0000"},"",{"v":0,"d":"0.00"},{"$f":"IF(R506=\"Interior\",IF(AND(L506=\"\",E506=\"\"),\"\",IF(OR(P506>0,O506=\"Enter Watts\",P506=\"\"),P506*N506*(1-X506)/1000,O506*N506(1-X506)/1000)),IF(AND(E506=\"\",L506=\"\"),\"\",0))","v":""},"","","","","",null,null,0,{"$nulls":3},"No"]
[null,488,{"$nulls":5},"",null,"",{"$nulls":4},"",null,"",null,"No",null,"",{"v":0,"d":"0.0000"},"",{"v":0,"d":"0.00"},{"$f":"IF(R507=\"Interior\",IF(AND(L507=\"\",E507=\"\"),\"\",IF(OR(P507>0,O507=\"Enter Watts\",P507=\"\"),P507*N507*(1-X507)/1000,O507*N507(1-X507)/1000)),IF(AND(E507=\"\",L507=\"\"),\"\",0))","v":""},"","","","","",null,null,0,{"$nulls":3},"No"]
[null,489,{"$nulls":5},"",null,"",{"$nulls":4},"",null,"",null,"No",null,"",{"v":0,"d":"0.0000"},"",{"v":0,"d":"0.00"},{"$f":"IF(R508=\"Interior\",IF(AND(L508=\"\",E508=\"\"),\"\",IF(OR(P508>0,O508=\"Enter Watts\",P508=\"\"),P508*N508*(1-X508)/1000,O508*N508(1-X508)/1000)),IF(AND(E508=\"\",L508=\"\"),\"\",0))","v":""},"","","","","",null,null,0,{"$nulls":3},"No"]
[null,490,{"$nulls":5},"",null,"",{"$nulls":4},"",null,"",null,"No",null,"",{"v":0,"d":"0.0000"},"",{"v":0,"d":"0.00"},{"$f":"IF(R509=\"Interior\",IF(AND(L509=\"\",E509=\"\"),\"\",IF(OR(P509>0,O509=\"Enter Watts\",P509=\"\"),P509*N509*(1-X509)/1000,O509*N509(1-X509)/1000)),IF(AND(E509=\"\",L509=\"\"),\"\",0))","v":""},"","","","","",null,null,0,{"$nulls":3},"No"]
[null,491,{"$nulls":5},"",null,"",{"$nulls":4},"",null,"",null,"No",null,"",{"v":0,"d":"0.0000"},"",{"v":0,"d":"0.00"},{"$f":"IF(R510=\"Interior\",IF(AND(L510=\"\",E510=\"\"),\"\",IF(OR(P510>0,O510=\"Enter Watts\",P510=\"\"),P510*N510*(1-X510)/1000,O510*N510(1-X510)/1000)),IF(AND(E510=\"\",L510=\"\"),\"\",0))","v":""},"","","","","",null,null,0,{"$nulls":3},"No",{"$nulls":6},"","",null,""]
[null,492,{"$nulls":5},"",null,"",{"$nulls":4},"",null,"",null,"No",null,"",{"v":0,"d":"0.0000"},"",{"v":0,"d":"0.00"},{"$f":"IF(R511=\"Interior\",IF(AND(L511=\"\",E511=\"\"),\"\",IF(OR(P511>0,O511=\"Enter Watts\",P511=\"\"),P511*N511*(1-X511)/1000,O511*N511(1-X511)/1000)),IF(AND(E511=\"\",L511=\"\"),\"\",0))","v":""},"","","","","",null,null,0,{"$nulls":3},"No"]
[null,493,{"$nulls":5},"",null,"",{"$nulls":4},"",null,"",null,"No",null,"",{"v":0,"d":"0.0000"},"",{"v":0,"d":"0.00"},{"$f":"IF(R512=\"Interior\",IF(AND(L512=\"\",E512=\"\"),\"\",IF(OR(P512>0,O512=\"Enter Watts\",P512=\"\"),P512*N512*(1-X512)/1000,O512*N512(1-X512)/1000)),IF(AND(E512=\"\",L512=\"\"),\"\",0))","v":""},"","","","","",null,null,0,{"$nulls":3},"No"]
[null,494,{"$nulls":5},{"$f":"IF(E513=\"\",\"\",VLOOKUP(E513,$AQ$1114:$AR$1541,2,FALSE))","v":""},null,"",{"$nulls":4},"",null,"",null,"No",null,"",{"v":0,"d":"0.0000"},"",{"v":0,"d":"0.00"},{"$f":"IF(R513=\"Interior\",IF(AND(L513=\"\",E513=\"\"),\"\",IF(OR(P513>0,O513=\"Enter Watts\",P513=\"\"),P513*N513*(1-X513)/1000,O513*N513(1-X513)/1000)),IF(AND(E513=\"\",L513=\"\"),\"\",0))","v":""},"","","","",{"$f":"IF(AC513=\"\",\"\",IF(AND(R513=\"Interior\",S513=\"No\",OR(T513=\"\",T513=\"No\")),$J$1027,IF(AND(R513=\"Interior\",S513=\"Yes\"),$J$1028,IF(AND(R513=\"Exterior\",S513=\"Yes\"),$J$1029,IF(AND(R513=\"Exterior\",S513=\"No\",N513<>G513),\"DNQ\",\"See Lighting Catalog to determine Code\")))))","v":""},null,null,0,{"$nulls":3},"No"]
[null,495,{"$nulls":5},"",null,"",{"$nulls":4},"",null,"",null,"No",null,"",{"v":0,"d":"0.0000"},"",{"v":0,"d":"0.00"},{"$f":"IF(R514=\"Interior\",IF(AND(L514=\"\",E514=\"\"),\"\",IF(OR(P514>0,O514=\"Enter Watts\",P514=\"\"),P514*N514*(1-X514)/1000,O514*N514(1-X514)/1000)),IF(AND(E514=\"\",L514=\"\"),\"\",0))","v":""},"","","","","",null,null,0,{"$nulls":3},"No"]
[null,496,{"$nulls":5},"",null,"",{"$nulls":4},"",null,"",null,"No",null,"",{"v":0,"d":"0.0000"},"",{"v":0,"d":"0.00"},{"$f":"IF(R515=\"Interior\",IF(AND(L515=\"\",E515=\"\"),\"\",IF(OR(P515>0,O515=\"Enter Watts\",P515=\"\"),P515*N515*(1-X515)/1000,O515*N515(1-X515)/1000)),IF(AND(E515=\"\",L515=\"\"),\"\",0))","v":""},"","","","","",null,null,0,{"$nulls":3},"No"]
[null,497,{"$nulls":5},"",null,"",{"$nulls":4},"",null,"",null,"No",null,"",{"v":0,"d":"0.0000"},"",{"v":0,"d":"0.00"},{"$f":"IF(R516=\"Interior\",IF(AND(L516=\"\",E516=\"\"),\"\",IF(OR(P516>0,O516=\"Enter Watts\",P516=\"\"),P516*N516*(1-X516)/1000,O516*N516(1-X516)/1000)),IF(AND(E516=\"\",L516=\"\"),\"\",0))","v":""},"","","","","",null,null,0,{"$nulls":3},"No",{"$nulls":6},"","",null,""]
[null,498,{"$nulls":5},"",null,"",{"$nulls":4},"",null,"",null,"No",null,"",{"v":0,"d":"0.0000"},"",{"v":0,"d":"0.00"},{"$f":"IF(R517=\"Interior\",IF(AND(L517=\"\",E517=\"\"),\"\",IF(OR(P517>0,O517=\"Enter Watts\",P517=\"\"),P517*N517*(1-X517)/1000,O517*N517(1-X517)/1000)),IF(AND(E517=\"\",L517=\"\"),\"\",0))","v":""},"","","","","",null,null,0,{"$nulls":3},"No"]
[null,499,{"$nulls":5},"",null,"",{"$nulls":4},"",null,"",null,"No",null,"",{"v":0,"d":"0.0000"},"",{"v":0,"d":"0.00"},{"$f":"IF(R518=\"Interior\",IF(AND(L518=\"\",E518=\"\"),\"\",IF(OR(P518>0,O518=\"Enter Watts\",P518=\"\"),P518*N518*(1-X518)/1000,O518*N518(1-X518)/1000)),IF(AND(E518=\"\",L518=\"\"),\"\",0))","v":""},"","","","","",null,null,0,{"$nulls":3},"No"]
[null,500,{"$nulls":5},"",null,"",{"$nulls":4},"",null,"",null,"No",null,"",{"v":0,"d":"0.0000"},"",{"v":0,"d":"0.00"},{"$f":"IF(R519=\"Interior\",IF(AND(L519=\"\",E519=\"\"),\"\",IF(OR(P519>0,O519=\"Enter Watts\",P519=\"\"),P519*N519*(1-X519)/1000,O519*N519(1-X519)/1000)),IF(AND(E519=\"\",L519=\"\"),\"\",0))","v":""},"","","","","",null,null,0,{"$nulls":3},"No"]
[null,501,{"$nulls":5},"",null,"",{"$nulls":4},"",null,"",null,"No",null,"",{"v":0,"d":"0.0000"},"",{"v":0,"d":"0.00"},{"$f":"IF(R520=\"Interior\",IF(AND(L520=\"\",E520=\"\"),\"\",IF(OR(P520>0,O520=\"Enter Watts\",P520=\"\"),P520*N520*(1-X520)/1000,O520*N520(1-X520)/1000)),IF(AND(E520=\"\",L520=\"\"),\"\",0))","v":""},"","","","","",null,null,0,{"$nulls":3},"No"]
[null,502,{"$nulls":5},"",null,"",{"$nulls":4},"",null,"",null,"No",null,"",{"v":0,"d":"0.0000"},"",{"v":0,"d":"0.00"},{"$f":"IF(R521=\"Interior\",IF(AND(L521=\"\",E521=\"\"),\"\",IF(OR(P521>0,O521=\"Enter Watts\",P521=\"\"),P521*N521*(1-X521)/1000,O521*N521(1-X521)/1000)),IF(AND(E521=\"\",L521=\"\"),\"\",0))","v":""},"","","","","",null,null,0,{"$nulls":3},"No"]
[null,503,{"$nulls":5},"",null,"",{"$nulls":4},"",null,"",null,"No",null,"",{"v":0,"d":"0.0000"},"",{"v":0,"d":"0.00"},{"$f":"IF(R522=\"Interior\",IF(AND(L522=\"\",E522=\"\"),\"\",IF(OR(P522>0,O522=\"Enter Watts\",P522=\"\"),P522*N522*(1-X522)/1000,O522*N522(1-X522)/1000)),IF(AND(E522=\"\",L522=\"\"),\"\",0))","v":""},"","","","","",null,null,0,{"$nulls":3},"No"]
[null,504,{"$nulls":5},"",null,"",{"$nulls":4},"",null,"",null,"No",null,"",{"v":0,"d":"0.0000"},"",{"v":0,"d":"0.00"},{"$f":"IF(R523=\"Interior\",IF(AND(L523=\"\",E523=\"\"),\"\",IF(OR(P523>0,O523=\"Enter Watts\",P523=\"\"),P523*N523*(1-X523)/1000,O523*N523(1-X523)/1000)),IF(AND(E523=\"\",L523=\"\"),\"\",0))","v":""},"",{"$f":"IFERROR(IF(OR(I523>0,H523=\"Enter Watts\"),I523*G523,H523*G523)-IF(OR(P523>0,O523=\"Enter Watts\"),P523*N523,O523*N523),\"\")","v":""},"",{"$f":"IF(AND(W523=\"\",Z523=\"\"),\"\",IF(OR(W523=\"\",Z523=\"\"),0,W523-Z523))","v":""},"",null,null,0,{"$nulls":3},"No"]
[null,505,{"$nulls":5},"",null,"",{"$nulls":4},"",null,"",null,"No",null,"",{"v":0,"d":"0.0000"},"",{"v":0,"d":"0.00"},{"$f":"IF(R524=\"Interior\",IF(AND(L524=\"\",E524=\"\"),\"\",IF(OR(P524>0,O524=\"Enter Watts\",P524=\"\"),P524*N524*(1-X524)/1000,O524*N524(1-X524)/1000)),IF(AND(E524=\"\",L524=\"\"),\"\",0))","v":""},"",{"$f":"IFERROR(IF(OR(I524>0,H524=\"Enter Watts\"),I524*G524,H524*G524)-IF(OR(P524>0,O524=\"Enter Watts\"),P524*N524,O524*N524),\"\")","v":""},"",{"$f":"IF(AND(W524=\"\",Z524=\"\"),\"\",IF(OR(W524=\"\",Z524=\"\"),0,W524-Z524))","v":""},"",null,null,0,{"$nulls":3},"No"]
[null,506,{"$nulls":5},"",null,"",{"$nulls":4},"",null,"",null,"No",null,"",{"v":0,"d":"0.0000"},"",{"v":0,"d":"0.00"},{"$f":"IF(R525=\"Interior\",IF(AND(L525=\"\",E525=\"\"),\"\",IF(OR(P525>0,O525=\"Enter Watts\",P525=\"\"),P525*N525*(1-X525)/1000,O525*N525(1-X525)/1000)),IF(AND(E525=\"\",L525=\"\"),\"\",0))","v":""},"","","","","",null,null,0,{"$nulls":3},"No"]
[null,507,{"$nulls":5},"",null,"",{"$nulls":4},"",null,"",null,"No",null,"",{"v":0,"d":"0.0000"},"",{"v":0,"d":"0.00"},{"$f":"IF(R526=\"Interior\",IF(AND(L526=\"\",E526=\"\"),\"\",IF(OR(P526>0,O526=\"Enter Watts\",P526=\"\"),P526*N526*(1-X526)/1000,O526*N526(1-X526)/1000)),IF(AND(E526=\"\",L526=\"\"),\"\",0))","v":""},"","","","","",null,null,0,{"$nulls":3},"No"]
[null,508,{"$nulls":5},"",null,"",{"$nulls":4},"",null,"",null,"No",null,"",{"v":0,"d":"0.0000"},"",{"v":0,"d":"0.00"},{"$f":"IF(R527=\"Interior\",IF(AND(L527=\"\",E527=\"\"),\"\",IF(OR(P527>0,O527=\"Enter Watts\",P527=\"\"),P527*N527*(1-X527)/1000,O527*N527(1-X527)/1000)),IF(AND(E527=\"\",L527=\"\"),\"\",0))","v":""},"","","","","",null,null,0,{"$nulls":3},"No",{"$nulls":6},"","",null,""]
[null,509,{"$nulls":5},"",null,"",{"$nulls":4},"",null,"",null,"No",null,"",{"v":0,"d":"0.0000"},"",{"v":0,"d":"0.00"},{"$f":"IF(R528=\"Interior\",IF(AND(L528=\"\",E528=\"\"),\"\",IF(OR(P528>0,O528=\"Enter Watts\",P528=\"\"),P528*N528*(1-X528)/1000,O528*N528(1-X528)/1000)),IF(AND(E528=\"\",L528=\"\"),\"\",0))","v":""},"","","","","",null,null,0,{"$nulls":3},"No"]
[null,510,{"$nulls":5},"",null,"",{"$nulls":4},"",null,"",null,"No",null,"",{"v":0,"d":"0.0000"},"",{"v":0,"d":"0.00"},{"$f":"IF(R529=\"Interior\",IF(AND(L529=\"\",E529=\"\"),\"\",IF(OR(P529>0,O529=\"Enter Watts\",P529=\"\"),P529*N529*(1-X529)/1000,O529*N529(1-X529)/1000)),IF(AND(E529=\"\",L529=\"\"),\"\",0))","v":""},"","","","","",null,null,0,{"$nulls":3},"No"]
[null,511,{"$nulls":5},"",null,"",{"$nulls":4},"",null,"",null,"No",null,"",{"v":0,"d":"0.0000"},"",{"v":0,"d":"0.00"},{"$f":"IF(R530=\"Interior\",IF(AND(L530=\"\",E530=\"\"),\"\",IF(OR(P530>0,O530=\"Enter Watts\",P530=\"\"),P530*N530*(1-X530)/1000,O530*N530(1-X530)/1000)),IF(AND(E530=\"\",L530=\"\"),\"\",0))","v":""},"","","","","",null,null,0,{"$nulls":3},"No"]
[null,512,{"$nulls":5},"",null,"",{"$nulls":4},"",null,"",null,"No",null,"",{"v":0,"d":"0.0000"},"",{"v":0,"d":"0.00"},{"$f":"IF(R531=\"Interior\",IF(AND(L531=\"\",E531=\"\"),\"\",IF(OR(P531>0,O531=\"Enter Watts\",P531=\"\"),P531*N531*(1-X531)/1000,O531*N531(1-X531)/1000)),IF(AND(E531=\"\",L531=\"\"),\"\",0))","v":""},"","","","","",null,null,0,{"$nulls":3},"No"]
[null,513,{"$nulls":5},"",null,{"$f":"IF(AND(E532<>\"\",G532<>\"\",$E$8=\"Default Sector Hours\"),VLOOKUP(IF(R532=\"Exterior\",\"Exterior\",$E$7),$W$1036:$X$1041,2,FALSE),\"\")","v":""},{"$nulls":4},{"$f":"IF(L532=\"\",\"\",VLOOKUP(L532,$AQ$1113:$AR$1541,2,FALSE))","v":""},null,"",null,"No",null,"",{"v":0,"d":"0.0000"},"",{"v":0,"d":"0.00"},{"$f":"IF(R532=\"Interior\",IF(AND(L532=\"\",E532=\"\"),\"\",IF(OR(P532>0,O532=\"Enter Watts\",P532=\"\"),P532*N532*(1-X532)/1000,O532*N532(1-X532)/1000)),IF(AND(E532=\"\",L532=\"\"),\"\",0))","v":""},{"$f":"IFERROR(IF(AND(L532=\"\", E532=\"\"),\"\",N532/1000*IF(OR(P532>0,O532=\"Enter Watts\"),P532,O532)*IF(R532=\"Exterior\",$X$1041,IF($E$8=\"Manual Input\",Q532,VLOOKUP($E$7,$W$1036:$Z$1040,2,FALSE)))*IF(S532=\"Yes\",IF(R532=\"Exterior\",1-$Z$1041,1-VLOOKUP($E$7,$W$1036:$Z$1040,4,FALSE)),1)),0)","v":""},"",{"$f":"IF(AND(U532=\"\",Y532=\"\"),\"\",IF(OR(U532=\"\",Y532=\"\"),0,  IF($E$8=\"Manual Input\",$G$9,   VLOOKUP($E$7,$W$1036:$Z$1041,3,FALSE))     *(U532-Y532)))","v":""},"","",null,null,0,{"$nulls":3},"No"]
[null,514,{"$nulls":5},"",null,"",{"$nulls":4},"",null,"",null,"No",null,{"$f":"IF(V533=\"Int Control\",IF(E533=\"\",\"\",IF(OR(I533>0,H533=\"Enter Watts\"),I533*G533/1000*(1-$E$15),H533*G533/1000*(1-$E$15))),IF(E533=\"\",\"\",IF(OR(I533>0,H533=\"Enter Watts\"),I533*G533/1000,H533*G533/1000)))","v":""},{"$f":"IF(AND(R533=\"Interior\",S533=\"Yes\"),\"Int Control\",0)","v":{"v":0,"d":"0.0000"}},{"$f":"IFERROR(IF(V533=\"Int Control\",IF(E533=\"\",\"\",G533/1000*(1-$E$15)*IF(OR(I533>0,H533=\"Enter Watts\"),I533,H533)*IF(R533=\"Exterior\",$X$1041*(1-$G$15),IF($E$8=\"Manual Input\",J533,VLOOKUP($E$7,$W$1036:$Z$1040,2,FALSE)*(1-$E$15)))),IF(E533=\"\",\"\",G533/1000*IF(OR(I533>0,H533=\"Enter Watts\"),I533,H533)*IF(R533=\"Exterior\",$X$1041,IF($E$8=\"Manual Input\",J533,VLOOKUP($E$7,$W$1036:$Z$1040,2,FALSE))))),\"0\")","v":""},{"$f":"IF(S533=\"No\",0,AA$1036)","v":{"v":0,"d":"0.00"}},{"$f":"IF(R533=\"Interior\",IF(AND(L533=\"\",E533=\"\"),\"\",IF(OR(P533>0,O533=\"Enter Watts\",P533=\"\"),P533*N533*(1-X533)/1000,O533*N533(1-X533)/1000)),IF(AND(E533=\"\",L533=\"\"),\"\",0))","v":""},"","","","","",null,null,{"$f":"AF533*N533","v":0},{"$nulls":3},{"$f":"IF(_xlfn.ISFORMULA(J533)=TRUE,\"No\",\"Yes\")","v":"No"},{"$nulls":6},"","",null,""]
[null,515,{"$nulls":5},"",null,"",{"$nulls":4},"",null,"",null,"No",null,"",{"v":0,"d":"0.0000"},"",{"v":0,"d":"0.00"},{"$f":"IF(R534=\"Interior\",IF(AND(L534=\"\",E534=\"\"),\"\",IF(OR(P534>0,O534=\"Enter Watts\",P534=\"\"),P534*N534*(1-X534)/1000,O534*N534(1-X534)/1000)),IF(AND(E534=\"\",L534=\"\"),\"\",0))","v":""},"","","","","",null,null,0,{"$nulls":3},"No"]
[null,516,{"$nulls":5},"",null,"",{"$nulls":4},"",null,"",null,"No",null,"",{"v":0,"d":"0.0000"},"",{"v":0,"d":"0.00"},{"$f":"IF(R535=\"Interior\",IF(AND(L535=\"\",E535=\"\"),\"\",IF(OR(P535>0,O535=\"Enter Watts\",P535=\"\"),P535*N535*(1-X535)/1000,O535*N535(1-X535)/1000)),IF(AND(E535=\"\",L535=\"\"),\"\",0))","v":""},"","","","","",null,null,0,{"$nulls":3},"No"]
[null,517,{"$nulls":5},"",null,"",{"$nulls":4},"",null,"",null,"No",null,"",{"v":0,"d":"0.0000"},"",{"v":0,"d":"0.00"},{"$f":"IF(R536=\"Interior\",IF(AND(L536=\"\",E536=\"\"),\"\",IF(OR(P536>0,O536=\"Enter Watts\",P536=\"\"),P536*N536*(1-X536)/1000,O536*N536(1-X536)/1000)),IF(AND(E536=\"\",L536=\"\"),\"\",0))","v":""},"","","","","",null,null,0,{"$nulls":3},"No"]
[null,518,{"$nulls":5},"",null,"",{"$nulls":4},"",null,"",null,"No",null,"",{"v":0,"d":"0.0000"},"",{"v":0,"d":"0.00"},{"$f":"IF(R537=\"Interior\",IF(AND(L537=\"\",E537=\"\"),\"\",IF(OR(P537>0,O537=\"Enter Watts\",P537=\"\"),P537*N537*(1-X537)/1000,O537*N537(1-X537)/1000)),IF(AND(E537=\"\",L537=\"\"),\"\",0))","v":""},"","","","","",null,null,0,{"$nulls":3},"No"]
[null,519,{"$nulls":5},"",null,"",{"$nulls":4},"",null,"",null,"No",null,"",{"v":0,"d":"0.0000"},"",{"v":0,"d":"0.00"},{"$f":"IF(R538=\"Interior\",IF(AND(L538=\"\",E538=\"\"),\"\",IF(OR(P538>0,O538=\"Enter Watts\",P538=\"\"),P538*N538*(1-X538)/1000,O538*N538(1-X538)/1000)),IF(AND(E538=\"\",L538=\"\"),\"\",0))","v":""},"","","","","",null,null,0,{"$nulls":3},"No"]
[null,520,{"$nulls":5},"",null,"",{"$nulls":4},"",null,"",null,"No",null,"",{"v":0,"d":"0.0000"},"",{"v":0,"d":"0.00"},{"$f":"IF(R539=\"Interior\",IF(AND(L539=\"\",E539=\"\"),\"\",IF(OR(P539>0,O539=\"Enter Watts\",P539=\"\"),P539*N539*(1-X539)/1000,O539*N539(1-X539)/1000)),IF(AND(E539=\"\",L539=\"\"),\"\",0))","v":""},"","","","","",null,null,0,{"$nulls":3},"No"]
[null,521,{"$nulls":5},"",null,"",{"$nulls":4},"",null,"",null,"No",null,"",{"v":0,"d":"0.0000"},"",{"v":0,"d":"0.00"},{"$f":"IF(R540=\"Interior\",IF(AND(L540=\"\",E540=\"\"),\"\",IF(OR(P540>0,O540=\"Enter Watts\",P540=\"\"),P540*N540*(1-X540)/1000,O540*N540(1-X540)/1000)),IF(AND(E540=\"\",L540=\"\"),\"\",0))","v":""},"","","","","",null,null,0,{"$nulls":3},"No",{"$nulls":6},"","",null,""]
[null,522,{"$nulls":5},"",null,"",{"$nulls":4},"",null,"",null,"No",null,"",{"v":0,"d":"0.0000"},"",{"v":0,"d":"0.00"},{"$f":"IF(R541=\"Interior\",IF(AND(L541=\"\",E541=\"\"),\"\",IF(OR(P541>0,O541=\"Enter Watts\",P541=\"\"),P541*N541*(1-X541)/1000,O541*N541(1-X541)/1000)),IF(AND(E541=\"\",L541=\"\"),\"\",0))","v":""},"","","","","",null,null,0,{"$nulls":3},"No"]
[null,523,{"$nulls":5},"",null,"",{"$nulls":4},"",null,"",null,"No",null,"",{"v":0,"d":"0.0000"},"",{"v":0,"d":"0.00"},{"$f":"IF(R542=\"Interior\",IF(AND(L542=\"\",E542=\"\"),\"\",IF(OR(P542>0,O542=\"Enter Watts\",P542=\"\"),P542*N542*(1-X542)/1000,O542*N542(1-X542)/1000)),IF(AND(E542=\"\",L542=\"\"),\"\",0))","v":""},"","","","","",null,null,0,{"$nulls":3},"No"]
[null,524,{"$nulls":5},"",null,"",{"$nulls":4},"",null,"",null,"No",null,"",{"v":0,"d":"0.0000"},"",{"v":0,"d":"0.00"},{"$f":"IF(R543=\"Interior\",IF(AND(L543=\"\",E543=\"\"),\"\",IF(OR(P543>0,O543=\"Enter Watts\",P543=\"\"),P543*N543*(1-X543)/1000,O543*N543(1-X543)/1000)),IF(AND(E543=\"\",L543=\"\"),\"\",0))","v":""},"","","","","",null,null,0,{"$nulls":3},"No"]
[null,525,{"$nulls":5},"",null,"",{"$nulls":4},"",null,"",null,"No",null,"",{"v":0,"d":"0.0000"},"",{"v":0,"d":"0.00"},{"$f":"IF(R544=\"Interior\",IF(AND(L544=\"\",E544=\"\"),\"\",IF(OR(P544>0,O544=\"Enter Watts\",P544=\"\"),P544*N544*(1-X544)/1000,O544*N544(1-X544)/1000)),IF(AND(E544=\"\",L544=\"\"),\"\",0))","v":""},"","","","","",null,null,0,{"$nulls":3},"No"]
[null,526,{"$nulls":5},"",null,"",{"$nulls":4},"",null,"",null,"No",null,"",{"v":0,"d":"0.0000"},"",{"v":0,"d":"0.00"},{"$f":"IF(R545=\"Interior\",IF(AND(L545=\"\",E545=\"\"),\"\",IF(OR(P545>0,O545=\"Enter Watts\",P545=\"\"),P545*N545*(1-X545)/1000,O545*N545(1-X545)/1000)),IF(AND(E545=\"\",L545=\"\"),\"\",0))","v":""},"","","","","",null,null,0,{"$nulls":3},"No"]
[null,527,{"$nulls":5},"",null,"",{"$nulls":4},"",null,"",null,"No",null,"",{"v":0,"d":"0.0000"},"",{"v":0,"d":"0.00"},{"$f":"IF(R546=\"Interior\",IF(AND(L546=\"\",E546=\"\"),\"\",IF(OR(P546>0,O546=\"Enter Watts\",P546=\"\"),P546*N546*(1-X546)/1000,O546*N546(1-X546)/1000)),IF(AND(E546=\"\",L546=\"\"),\"\",0))","v":""},"","","","","",null,null,0,{"$nulls":3},"No",{"$nulls":6},"","",null,""]
[null,528,{"$nulls":5},"",null,"",{"$nulls":4},"",null,"",null,"No",null,"",{"v":0,"d":"0.0000"},"",{"v":0,"d":"0.00"},{"$f":"IF(R547=\"Interior\",IF(AND(L547=\"\",E547=\"\"),\"\",IF(OR(P547>0,O547=\"Enter Watts\",P547=\"\"),P547*N547*(1-X547)/1000,O547*N547(1-X547)/1000)),IF(AND(E547=\"\",L547=\"\"),\"\",0))","v":""},"","","","","",null,null,0,{"$nulls":3},"No"]
[null,529,{"$nulls":5},"",null,"",{"$nulls":4},"",null,"",null,"No",null,"",{"v":0,"d":"0.0000"},"",{"v":0,"d":"0.00"},{"$f":"IF(R548=\"Interior\",IF(AND(L548=\"\",E548=\"\"),\"\",IF(OR(P548>0,O548=\"Enter Watts\",P548=\"\"),P548*N548*(1-X548)/1000,O548*N548(1-X548)/1000)),IF(AND(E548=\"\",L548=\"\"),\"\",0))","v":""},"","","","","",null,null,0,{"$nulls":3},"No"]
[null,530,{"$nulls":5},"",null,"",{"$nulls":4},"",null,"",null,"No",null,"",{"v":0,"d":"0.0000"},"",{"v":0,"d":"0.00"},{"$f":"IF(R549=\"Interior\",IF(AND(L549=\"\",E549=\"\"),\"\",IF(OR(P549>0,O549=\"Enter Watts\",P549=\"\"),P549*N549*(1-X549)/1000,O549*N549(1-X549)/1000)),IF(AND(E549=\"\",L549=\"\"),\"\",0))","v":""},"","","","","",null,null,0,{"$nulls":3},"No"]
[null,531,{"$nulls":5},"",null,"",{"$nulls":4},"",null,"",null,"No",null,"",{"v":0,"d":"0.0000"},"",{"v":0,"d":"0.00"},{"$f":"IF(R550=\"Interior\",IF(AND(L550=\"\",E550=\"\"),\"\",IF(OR(P550>0,O550=\"Enter Watts\",P550=\"\"),P550*N550*(1-X550)/1000,O550*N550(1-X550)/1000)),IF(AND(E550=\"\",L550=\"\"),\"\",0))","v":""},"","","","","",null,null,0,{"$nulls":3},"No"]
[null,532,{"$nulls":5},"",null,"",{"$nulls":4},"",null,"",null,"No",null,"",{"v":0,"d":"0.0000"},"",{"v":0,"d":"0.00"},{"$f":"IF(R551=\"Interior\",IF(AND(L551=\"\",E551=\"\"),\"\",IF(OR(P551>0,O551=\"Enter Watts\",P551=\"\"),P551*N551*(1-X551)/1000,O551*N551(1-X551)/1000)),IF(AND(E551=\"\",L551=\"\"),\"\",0))","v":""},"","","","","",null,null,0,{"$nulls":3},"No"]
[null,533,{"$nulls":5},"",null,"",{"$nulls":4},"",null,"",null,"No",null,"",{"v":0,"d":"0.0000"},"",{"v":0,"d":"0.00"},{"$f":"IF(R552=\"Interior\",IF(AND(L552=\"\",E552=\"\"),\"\",IF(OR(P552>0,O552=\"Enter Watts\",P552=\"\"),P552*N552*(1-X552)/1000,O552*N552(1-X552)/1000)),IF(AND(E552=\"\",L552=\"\"),\"\",0))","v":""},"","","","","",null,null,0,{"$nulls":3},"No"]
[null,534,{"$nulls":5},"",null,"",{"$nulls":4},"",null,"",null,"No",null,"",{"v":0,"d":"0.0000"},"",{"v":0,"d":"0.00"},{"$f":"IF(R553=\"Interior\",IF(AND(L553=\"\",E553=\"\"),\"\",IF(OR(P553>0,O553=\"Enter Watts\",P553=\"\"),P553*N553*(1-X553)/1000,O553*N553(1-X553)/1000)),IF(AND(E553=\"\",L553=\"\"),\"\",0))","v":""},"","","","","",null,null,0,{"$nulls":3},"No"]
[null,535,{"$nulls":5},"",null,"",{"$nulls":4},"",null,"",null,"No",null,"",{"v":0,"d":"0.0000"},"",{"v":0,"d":"0.00"},{"$f":"IF(R554=\"Interior\",IF(AND(L554=\"\",E554=\"\"),\"\",IF(OR(P554>0,O554=\"Enter Watts\",P554=\"\"),P554*N554*(1-X554)/1000,O554*N554(1-X554)/1000)),IF(AND(E554=\"\",L554=\"\"),\"\",0))","v":""},"","","","","",null,null,0,{"$nulls":3},"No"]
[null,536,{"$nulls":5},"",null,"",{"$nulls":4},"",null,"",null,"No",null,"",{"v":0,"d":"0.0000"},"",{"v":0,"d":"0.00"},{"$f":"IF(R555=\"Interior\",IF(AND(L555=\"\",E555=\"\"),\"\",IF(OR(P555>0,O555=\"Enter Watts\",P555=\"\"),P555*N555*(1-X555)/1000,O555*N555(1-X555)/1000)),IF(AND(E555=\"\",L555=\"\"),\"\",0))","v":""},"","","","","",null,null,0,{"$nulls":3},"No"]
[null,537,{"$nulls":5},"",null,"",{"$nulls":4},"",null,"",null,"No",null,"",{"v":0,"d":"0.0000"},"",{"v":0,"d":"0.00"},{"$f":"IF(R556=\"Interior\",IF(AND(L556=\"\",E556=\"\"),\"\",IF(OR(P556>0,O556=\"Enter Watts\",P556=\"\"),P556*N556*(1-X556)/1000,O556*N556(1-X556)/1000)),IF(AND(E556=\"\",L556=\"\"),\"\",0))","v":""},"","","","","",null,null,0,{"$nulls":3},"No"]
[null,538,{"$nulls":5},"",null,"",{"$nulls":4},"",null,"",null,"No",null,"",{"v":0,"d":"0.0000"},"",{"v":0,"d":"0.00"},{"$f":"IF(R557=\"Interior\",IF(AND(L557=\"\",E557=\"\"),\"\",IF(OR(P557>0,O557=\"Enter Watts\",P557=\"\"),P557*N557*(1-X557)/1000,O557*N557(1-X557)/1000)),IF(AND(E557=\"\",L557=\"\"),\"\",0))","v":""},"","","","","",null,null,0,{"$nulls":3},"No"]
[null,539,{"$nulls":5},"",null,"",{"$nulls":4},"",null,"",null,"No",null,"",{"v":0,"d":"0.0000"},"",{"v":0,"d":"0.00"},{"$f":"IF(R558=\"Interior\",IF(AND(L558=\"\",E558=\"\"),\"\",IF(OR(P558>0,O558=\"Enter Watts\",P558=\"\"),P558*N558*(1-X558)/1000,O558*N558(1-X558)/1000)),IF(AND(E558=\"\",L558=\"\"),\"\",0))","v":""},"","","","","",null,null,0,{"$nulls":3},"No",{"$nulls":6},"","",null,""]
[null,540,{"$nulls":5},"",null,"",{"$nulls":4},"",null,"",null,"No",null,"",{"v":0,"d":"0.0000"},"",{"v":0,"d":"0.00"},{"$f":"IF(R559=\"Interior\",IF(AND(L559=\"\",E559=\"\"),\"\",IF(OR(P559>0,O559=\"Enter Watts\",P559=\"\"),P559*N559*(1-X559)/1000,O559*N559(1-X559)/1000)),IF(AND(E559=\"\",L559=\"\"),\"\",0))","v":""},"","","","","",null,null,0,{"$nulls":3},"No"]
[null,541,{"$nulls":5},"",null,"",{"$nulls":4},"",null,"",null,"No",null,"",{"v":0,"d":"0.0000"},"",{"v":0,"d":"0.00"},{"$f":"IF(R560=\"Interior\",IF(AND(L560=\"\",E560=\"\"),\"\",IF(OR(P560>0,O560=\"Enter Watts\",P560=\"\"),P560*N560*(1-X560)/1000,O560*N560(1-X560)/1000)),IF(AND(E560=\"\",L560=\"\"),\"\",0))","v":""},"","","","","",null,null,0,{"$nulls":3},"No"]
[null,542,{"$nulls":5},"",null,"",{"$nulls":4},"",null,"",null,"No",null,"",{"v":0,"d":"0.0000"},"",{"v":0,"d":"0.00"},{"$f":"IF(R561=\"Interior\",IF(AND(L561=\"\",E561=\"\"),\"\",IF(OR(P561>0,O561=\"Enter Watts\",P561=\"\"),P561*N561*(1-X561)/1000,O561*N561(1-X561)/1000)),IF(AND(E561=\"\",L561=\"\"),\"\",0))","v":""},"","","","","",null,null,0,{"$nulls":3},"No"]
[null,543,{"$nulls":5},"",null,"",{"$nulls":4},"",null,"",null,"No",null,"",{"v":0,"d":"0.0000"},"",{"v":0,"d":"0.00"},{"$f":"IF(R562=\"Interior\",IF(AND(L562=\"\",E562=\"\"),\"\",IF(OR(P562>0,O562=\"Enter Watts\",P562=\"\"),P562*N562*(1-X562)/1000,O562*N562(1-X562)/1000)),IF(AND(E562=\"\",L562=\"\"),\"\",0))","v":""},"","","","","",null,null,0,{"$nulls":3},"No"]
[null,544,{"$nulls":5},"",null,"",{"$nulls":4},"",null,"",null,"No",null,"",{"v":0,"d":"0.0000"},"",{"v":0,"d":"0.00"},{"$f":"IF(R563=\"Interior\",IF(AND(L563=\"\",E563=\"\"),\"\",IF(OR(P563>0,O563=\"Enter Watts\",P563=\"\"),P563*N563*(1-X563)/1000,O563*N563(1-X563)/1000)),IF(AND(E563=\"\",L563=\"\"),\"\",0))","v":""},"","","","","",null,null,0,{"$nulls":3},"No"]
[null,545,{"$nulls":5},"",null,"",{"$nulls":4},"",null,"",null,"No",null,"",{"v":0,"d":"0.0000"},"",{"v":0,"d":"0.00"},{"$f":"IF(R564=\"Interior\",IF(AND(L564=\"\",E564=\"\"),\"\",IF(OR(P564>0,O564=\"Enter Watts\",P564=\"\"),P564*N564*(1-X564)/1000,O564*N564(1-X564)/1000)),IF(AND(E564=\"\",L564=\"\"),\"\",0))","v":""},"","","","","",null,null,0,{"$nulls":3},"No",{"$nulls":6},"","",null,""]
[null,546,{"$nulls":5},"",null,"",{"$nulls":4},"",null,"",null,"No",null,"",{"v":0,"d":"0.0000"},"",{"v":0,"d":"0.00"},{"$f":"IF(R565=\"Interior\",IF(AND(L565=\"\",E565=\"\"),\"\",IF(OR(P565>0,O565=\"Enter Watts\",P565=\"\"),P565*N565*(1-X565)/1000,O565*N565(1-X565)/1000)),IF(AND(E565=\"\",L565=\"\"),\"\",0))","v":""},"","","","","",null,null,0,{"$nulls":3},"No"]
[null,547,{"$nulls":5},"",null,"",{"$nulls":4},"",null,"",null,"No",null,"",{"v":0,"d":"0.0000"},"",{"v":0,"d":"0.00"},{"$f":"IF(R566=\"Interior\",IF(AND(L566=\"\",E566=\"\"),\"\",IF(OR(P566>0,O566=\"Enter Watts\",P566=\"\"),P566*N566*(1-X566)/1000,O566*N566(1-X566)/1000)),IF(AND(E566=\"\",L566=\"\"),\"\",0))","v":""},"","","","","",null,null,0,{"$nulls":3},"No"]
[null,548,{"$nulls":5},"",null,"",{"$nulls":4},"",null,"",null,"No",null,"",{"v":0,"d":"0.0000"},"",{"v":0,"d":"0.00"},{"$f":"IF(R567=\"Interior\",IF(AND(L567=\"\",E567=\"\"),\"\",IF(OR(P567>0,O567=\"Enter Watts\",P567=\"\"),P567*N567*(1-X567)/1000,O567*N567(1-X567)/1000)),IF(AND(E567=\"\",L567=\"\"),\"\",0))","v":""},"","","","","",null,null,0,{"$nulls":3},"No"]
[null,549,{"$nulls":5},"",null,"",{"$nulls":4},"",null,"",null,"No",null,"",{"v":0,"d":"0.0000"},"",{"v":0,"d":"0.00"},{"$f":"IF(R568=\"Interior\",IF(AND(L568=\"\",E568=\"\"),\"\",IF(OR(P568>0,O568=\"Enter Watts\",P568=\"\"),P568*N568*(1-X568)/1000,O568*N568(1-X568)/1000)),IF(AND(E568=\"\",L568=\"\"),\"\",0))","v":""},"","","","","",null,null,0,{"$nulls":3},"No"]
[null,550,{"$nulls":5},"",null,"",{"$nulls":4},"",null,"",null,"No",null,"",{"v":0,"d":"0.0000"},"",{"v":0,"d":"0.00"},{"$f":"IF(R569=\"Interior\",IF(AND(L569=\"\",E569=\"\"),\"\",IF(OR(P569>0,O569=\"Enter Watts\",P569=\"\"),P569*N569*(1-X569)/1000,O569*N569(1-X569)/1000)),IF(AND(E569=\"\",L569=\"\"),\"\",0))","v":""},"","","","","",null,null,0,{"$nulls":3},"No"]
[null,551,{"$nulls":5},"",null,"",{"$nulls":4},"",null,"",null,"No",null,"",{"v":0,"d":"0.0000"},"",{"v":0,"d":"0.00"},{"$f":"IF(R570=\"Interior\",IF(AND(L570=\"\",E570=\"\"),\"\",IF(OR(P570>0,O570=\"Enter Watts\",P570=\"\"),P570*N570*(1-X570)/1000,O570*N570(1-X570)/1000)),IF(AND(E570=\"\",L570=\"\"),\"\",0))","v":""},"","","","","",null,null,0,{"$nulls":3},"No"]
[null,552,{"$nulls":5},"",null,"",{"$nulls":4},"",null,"",null,"No",null,"",{"v":0,"d":"0.0000"},"",{"v":0,"d":"0.00"},{"$f":"IF(R571=\"Interior\",IF(AND(L571=\"\",E571=\"\"),\"\",IF(OR(P571>0,O571=\"Enter Watts\",P571=\"\"),P571*N571*(1-X571)/1000,O571*N571(1-X571)/1000)),IF(AND(E571=\"\",L571=\"\"),\"\",0))","v":""},"",{"$f":"IFERROR(IF(OR(I571>0,H571=\"Enter Watts\"),I571*G571,H571*G571)-IF(OR(P571>0,O571=\"Enter Watts\"),P571*N571,O571*N571),\"\")","v":""},"",{"$f":"IF(AND(W571=\"\",Z571=\"\"),\"\",IF(OR(W571=\"\",Z571=\"\"),0,W571-Z571))","v":""},"",null,null,0,{"$nulls":3},"No"]
[null,553,{"$nulls":5},"",null,"",{"$nulls":4},"",null,"",null,"No",null,"",{"v":0,"d":"0.0000"},"",{"v":0,"d":"0.00"},{"$f":"IF(R572=\"Interior\",IF(AND(L572=\"\",E572=\"\"),\"\",IF(OR(P572>0,O572=\"Enter Watts\",P572=\"\"),P572*N572*(1-X572)/1000,O572*N572(1-X572)/1000)),IF(AND(E572=\"\",L572=\"\"),\"\",0))","v":""},"",{"$f":"IFERROR(IF(OR(I572>0,H572=\"Enter Watts\"),I572*G572,H572*G572)-IF(OR(P572>0,O572=\"Enter Watts\"),P572*N572,O572*N572),\"\")","v":""},"",{"$f":"IF(AND(W572=\"\",Z572=\"\"),\"\",IF(OR(W572=\"\",Z572=\"\"),0,W572-Z572))","v":""},"",null,null,0,{"$nulls":3},"No"]
[null,554,{"$nulls":5},"",null,"",{"$nulls":4},"",null,"",null,"No",null,"",{"v":0,"d":"0.0000"},"",{"v":0,"d":"0.00"},{"$f":"IF(R573=\"Interior\",IF(AND(L573=\"\",E573=\"\"),\"\",IF(OR(P573>0,O573=\"Enter Watts\",P573=\"\"),P573*N573*(1-X573)/1000,O573*N573(1-X573)/1000)),IF(AND(E573=\"\",L573=\"\"),\"\",0))","v":""},"","","","","",null,null,0,{"$nulls":3},"No"]
[null,555,{"$nulls":5},"",null,"",{"$nulls":4},"",null,"",null,"No",null,"",{"v":0,"d":"0.0000"},"",{"v":0,"d":"0.00"},{"$f":"IF(R574=\"Interior\",IF(AND(L574=\"\",E574=\"\"),\"\",IF(OR(P574>0,O574=\"Enter Watts\",P574=\"\"),P574*N574*(1-X574)/1000,O574*N574(1-X574)/1000)),IF(AND(E574=\"\",L574=\"\"),\"\",0))","v":""},"","","","","",null,null,0,{"$nulls":3},"No"]
[null,556,{"$nulls":5},"",null,"",{"$nulls":4},"",null,"",null,"No",null,"",{"v":0,"d":"0.0000"},"",{"v":0,"d":"0.00"},{"$f":"IF(R575=\"Interior\",IF(AND(L575=\"\",E575=\"\"),\"\",IF(OR(P575>0,O575=\"Enter Watts\",P575=\"\"),P575*N575*(1-X575)/1000,O575*N575(1-X575)/1000)),IF(AND(E575=\"\",L575=\"\"),\"\",0))","v":""},"","","","","",null,null,0,{"$nulls":3},"No",{"$nulls":6},"","",null,""]
[null,557,{"$nulls":5},"",null,"",{"$nulls":4},"",null,{"$f":"IF(J576=\"\",\"\",J576)","v":""},null,"No",null,"",{"v":0,"d":"0.0000"},"",{"v":0,"d":"0.00"},{"$f":"IF(R576=\"Interior\",IF(AND(L576=\"\",E576=\"\"),\"\",IF(OR(P576>0,O576=\"Enter Watts\",P576=\"\"),P576*N576*(1-X576)/1000,O576*N576(1-X576)/1000)),IF(AND(E576=\"\",L576=\"\"),\"\",0))","v":""},"","","","","",null,null,0,{"$nulls":3},"No"]
[null,558,{"$nulls":5},{"$f":"IF(E577=\"\",\"\",VLOOKUP(E577,$AQ$1114:$AR$1541,2,FALSE))","v":""},null,"",{"$nulls":4},"",null,"",null,"No",null,"",{"v":0,"d":"0.0000"},"",{"v":0,"d":"0.00"},{"$f":"IF(R577=\"Interior\",IF(AND(L577=\"\",E577=\"\"),\"\",IF(OR(P577>0,O577=\"Enter Watts\",P577=\"\"),P577*N577*(1-X577)/1000,O577*N577(1-X577)/1000)),IF(AND(E577=\"\",L577=\"\"),\"\",0))","v":""},"","","","",{"$f":"IF(AC577=\"\",\"\",IF(AND(R577=\"Interior\",S577=\"No\",OR(T577=\"\",T577=\"No\")),$J$1027,IF(AND(R577=\"Interior\",S577=\"Yes\"),$J$1028,IF(AND(R577=\"Exterior\",S577=\"Yes\"),$J$1029,IF(AND(R577=\"Exterior\",S577=\"No\",N577<>G577),\"DNQ\",\"See Lighting Catalog to determine Code\")))))","v":""},null,null,0,{"$nulls":3},"No"]
[null,559,{"$nulls":5},"",null,"",{"$nulls":4},"",null,"",null,"No",null,"",{"v":0,"d":"0.0000"},"",{"v":0,"d":"0.00"},{"$f":"IF(R578=\"Interior\",IF(AND(L578=\"\",E578=\"\"),\"\",IF(OR(P578>0,O578=\"Enter Watts\",P578=\"\"),P578*N578*(1-X578)/1000,O578*N578(1-X578)/1000)),IF(AND(E578=\"\",L578=\"\"),\"\",0))","v":""},"","","","","",null,null,0,{"$nulls":3},"No"]
[null,560,{"$nulls":5},"",null,"",{"$nulls":4},"",null,"",null,"No",null,"",{"v":0,"d":"0.0000"},"",{"v":0,"d":"0.00"},{"$f":"IF(R579=\"Interior\",IF(AND(L579=\"\",E579=\"\"),\"\",IF(OR(P579>0,O579=\"Enter Watts\",P579=\"\"),P579*N579*(1-X579)/1000,O579*N579(1-X579)/1000)),IF(AND(E579=\"\",L579=\"\"),\"\",0))","v":""},"","","","","",null,null,0,{"$nulls":3},"No"]
[null,561,{"$nulls":5},"",null,"",{"$nulls":4},"",null,"",null,"No",null,"",{"v":0,"d":"0.0000"},"",{"v":0,"d":"0.00"},{"$f":"IF(R580=\"Interior\",IF(AND(L580=\"\",E580=\"\"),\"\",IF(OR(P580>0,O580=\"Enter Watts\",P580=\"\"),P580*N580*(1-X580)/1000,O580*N580(1-X580)/1000)),IF(AND(E580=\"\",L580=\"\"),\"\",0))","v":""},"","","","","",null,null,0,{"$nulls":3},"No"]
[null,562,{"$nulls":5},"",null,"",{"$nulls":4},"",null,"",null,"No",null,"",{"v":0,"d":"0.0000"},"",{"v":0,"d":"0.00"},{"$f":"IF(R581=\"Interior\",IF(AND(L581=\"\",E581=\"\"),\"\",IF(OR(P581>0,O581=\"Enter Watts\",P581=\"\"),P581*N581*(1-X581)/1000,O581*N581(1-X581)/1000)),IF(AND(E581=\"\",L581=\"\"),\"\",0))","v":""},"","","","","",null,null,0,{"$nulls":3},"No",{"$nulls":6},"","",null,""]
[null,563,{"$nulls":5},"",null,"",{"$nulls":4},"",null,"",null,"No",null,"",{"v":0,"d":"0.0000"},"",{"v":0,"d":"0.00"},{"$f":"IF(R582=\"Interior\",IF(AND(L582=\"\",E582=\"\"),\"\",IF(OR(P582>0,O582=\"Enter Watts\",P582=\"\"),P582*N582*(1-X582)/1000,O582*N582(1-X582)/1000)),IF(AND(E582=\"\",L582=\"\"),\"\",0))","v":""},"","","","","",null,null,0,{"$nulls":3},"No"]
[null,564,{"$nulls":5},"",null,"",{"$nulls":4},"",null,"",null,"No",null,"",{"v":0,"d":"0.0000"},"",{"v":0,"d":"0.00"},{"$f":"IF(R583=\"Interior\",IF(AND(L583=\"\",E583=\"\"),\"\",IF(OR(P583>0,O583=\"Enter Watts\",P583=\"\"),P583*N583*(1-X583)/1000,O583*N583(1-X583)/1000)),IF(AND(E583=\"\",L583=\"\"),\"\",0))","v":""},"","","","","",null,null,0,{"$nulls":3},"No"]
[null,565,{"$nulls":5},"",null,"",{"$nulls":4},"",null,"",null,"No",null,"",{"v":0,"d":"0.0000"},"",{"v":0,"d":"0.00"},{"$f":"IF(R584=\"Interior\",IF(AND(L584=\"\",E584=\"\"),\"\",IF(OR(P584>0,O584=\"Enter Watts\",P584=\"\"),P584*N584*(1-X584)/1000,O584*N584(1-X584)/1000)),IF(AND(E584=\"\",L584=\"\"),\"\",0))","v":""},"","","","","",null,null,0,{"$nulls":3},"No"]
[null,566,{"$nulls":5},"",null,"",{"$nulls":4},"",null,"",null,"No",null,"",{"v":0,"d":"0.0000"},"",{"v":0,"d":"0.00"},{"$f":"IF(R585=\"Interior\",IF(AND(L585=\"\",E585=\"\"),\"\",IF(OR(P585>0,O585=\"Enter Watts\",P585=\"\"),P585*N585*(1-X585)/1000,O585*N585(1-X585)/1000)),IF(AND(E585=\"\",L585=\"\"),\"\",0))","v":""},"","","","","",null,null,0,{"$nulls":3},"No"]
[null,567,{"$nulls":5},"",null,"",{"$nulls":4},"",null,"",null,"No",null,"",{"v":0,"d":"0.0000"},"",{"v":0,"d":"0.00"},{"$f":"IF(R586=\"Interior\",IF(AND(L586=\"\",E586=\"\"),\"\",IF(OR(P586>0,O586=\"Enter Watts\",P586=\"\"),P586*N586*(1-X586)/1000,O586*N586(1-X586)/1000)),IF(AND(E586=\"\",L586=\"\"),\"\",0))","v":""},"","","","","",null,null,0,{"$nulls":3},"No"]
[null,568,{"$nulls":5},"",null,"",{"$nulls":4},"",null,"",null,"No",null,"",{"v":0,"d":"0.0000"},"",{"v":0,"d":"0.00"},{"$f":"IF(R587=\"Interior\",IF(AND(L587=\"\",E587=\"\"),\"\",IF(OR(P587>0,O587=\"Enter Watts\",P587=\"\"),P587*N587*(1-X587)/1000,O587*N587(1-X587)/1000)),IF(AND(E587=\"\",L587=\"\"),\"\",0))","v":""},"","","","","",null,null,0,{"$nulls":3},"No"]
[null,569,{"$nulls":5},"",null,"",{"$nulls":4},"",null,"",null,"No",null,"",{"v":0,"d":"0.0000"},"",{"v":0,"d":"0.00"},{"$f":"IF(R588=\"Interior\",IF(AND(L588=\"\",E588=\"\"),\"\",IF(OR(P588>0,O588=\"Enter Watts\",P588=\"\"),P588*N588*(1-X588)/1000,O588*N588(1-X588)/1000)),IF(AND(E588=\"\",L588=\"\"),\"\",0))","v":""},"","","","","",null,null,0,{"$nulls":3},"No",{"$nulls":6},"","",null,""]
[null,570,{"$nulls":5},"",null,"",{"$nulls":4},"",null,"",null,"No",null,"",{"v":0,"d":"0.0000"},"",{"v":0,"d":"0.00"},{"$f":"IF(R589=\"Interior\",IF(AND(L589=\"\",E589=\"\"),\"\",IF(OR(P589>0,O589=\"Enter Watts\",P589=\"\"),P589*N589*(1-X589)/1000,O589*N589(1-X589)/1000)),IF(AND(E589=\"\",L589=\"\"),\"\",0))","v":""},"","","","","",null,null,0,{"$nulls":3},"No"]
[null,571,{"$nulls":5},"",null,"",{"$nulls":4},"",null,"",null,"No",null,"",{"v":0,"d":"0.0000"},"",{"v":0,"d":"0.00"},{"$f":"IF(R590=\"Interior\",IF(AND(L590=\"\",E590=\"\"),\"\",IF(OR(P590>0,O590=\"Enter Watts\",P590=\"\"),P590*N590*(1-X590)/1000,O590*N590(1-X590)/1000)),IF(AND(E590=\"\",L590=\"\"),\"\",0))","v":""},"","","","","",null,null,0,{"$nulls":3},"No"]
[null,572,{"$nulls":5},"",null,"",{"$nulls":4},"",null,"",null,"No",null,"",{"v":0,"d":"0.0000"},"",{"v":0,"d":"0.00"},{"$f":"IF(R591=\"Interior\",IF(AND(L591=\"\",E591=\"\"),\"\",IF(OR(P591>0,O591=\"Enter Watts\",P591=\"\"),P591*N591*(1-X591)/1000,O591*N591(1-X591)/1000)),IF(AND(E591=\"\",L591=\"\"),\"\",0))","v":""},"","","","","",null,null,0,{"$nulls":3},"No"]
[null,573,{"$nulls":5},"",null,"",{"$nulls":4},"",null,"",null,"No",null,"",{"v":0,"d":"0.0000"},"",{"v":0,"d":"0.00"},{"$f":"IF(R592=\"Interior\",IF(AND(L592=\"\",E592=\"\"),\"\",IF(OR(P592>0,O592=\"Enter Watts\",P592=\"\"),P592*N592*(1-X592)/1000,O592*N592(1-X592)/1000)),IF(AND(E592=\"\",L592=\"\"),\"\",0))","v":""},"","","","","",null,null,0,{"$nulls":3},"No"]
[null,574,{"$nulls":5},"",null,"",{"$nulls":4},"",null,"",null,"No",null,"",{"v":0,"d":"0.0000"},"",{"v":0,"d":"0.00"},{"$f":"IF(R593=\"Interior\",IF(AND(L593=\"\",E593=\"\"),\"\",IF(OR(P593>0,O593=\"Enter Watts\",P593=\"\"),P593*N593*(1-X593)/1000,O593*N593(1-X593)/1000)),IF(AND(E593=\"\",L593=\"\"),\"\",0))","v":""},"","","","","",null,null,0,{"$nulls":3},"No"]
[null,575,{"$nulls":5},"",null,"",{"$nulls":4},"",null,"",null,"No",null,"",{"v":0,"d":"0.0000"},"",{"v":0,"d":"0.00"},{"$f":"IF(R594=\"Interior\",IF(AND(L594=\"\",E594=\"\"),\"\",IF(OR(P594>0,O594=\"Enter Watts\",P594=\"\"),P594*N594*(1-X594)/1000,O594*N594(1-X594)/1000)),IF(AND(E594=\"\",L594=\"\"),\"\",0))","v":""},"","","","","",null,null,0,{"$nulls":3},"No",{"$nulls":6},"","",null,""]
[null,576,{"$nulls":5},"",null,"",{"$nulls":4},"",null,"",null,"No",null,"",{"v":0,"d":"0.0000"},"",{"v":0,"d":"0.00"},{"$f":"IF(R595=\"Interior\",IF(AND(L595=\"\",E595=\"\"),\"\",IF(OR(P595>0,O595=\"Enter Watts\",P595=\"\"),P595*N595*(1-X595)/1000,O595*N595(1-X595)/1000)),IF(AND(E595=\"\",L595=\"\"),\"\",0))","v":""},"","","","","",null,null,0,{"$nulls":3},"No"]
[null,577,{"$nulls":5},"",null,{"$f":"IF(AND(E596<>\"\",G596<>\"\",$E$8=\"Default Sector Hours\"),VLOOKUP(IF(R596=\"Exterior\",\"Exterior\",$E$7),$W$1036:$X$1041,2,FALSE),\"\")","v":""},{"$nulls":4},{"$f":"IF(L596=\"\",\"\",VLOOKUP(L596,$AQ$1113:$AR$1541,2,FALSE))","v":""},null,"",null,"No",null,"",{"v":0,"d":"0.0000"},"",{"v":0,"d":"0.00"},{"$f":"IF(R596=\"Interior\",IF(AND(L596=\"\",E596=\"\"),\"\",IF(OR(P596>0,O596=\"Enter Watts\",P596=\"\"),P596*N596*(1-X596)/1000,O596*N596(1-X596)/1000)),IF(AND(E596=\"\",L596=\"\"),\"\",0))","v":""},{"$f":"IFERROR(IF(AND(L596=\"\", E596=\"\"),\"\",N596/1000*IF(OR(P596>0,O596=\"Enter Watts\"),P596,O596)*IF(R596=\"Exterior\",$X$1041,IF($E$8=\"Manual Input\",Q596,VLOOKUP($E$7,$W$1036:$Z$1040,2,FALSE)))*IF(S596=\"Yes\",IF(R596=\"Exterior\",1-$Z$1041,1-VLOOKUP($E$7,$W$1036:$Z$1040,4,FALSE)),1)),0)","v":""},"",{"$f":"IF(AND(U596=\"\",Y596=\"\"),\"\",IF(OR(U596=\"\",Y596=\"\"),0,  IF($E$8=\"Manual Input\",$G$9,   VLOOKUP($E$7,$W$1036:$Z$1041,3,FALSE))     *(U596-Y596)))","v":""},"","",null,null,0,{"$nulls":3},"No"]
[null,578,{"$nulls":5},"",null,"",{"$nulls":4},"",null,"",null,"No",null,{"$f":"IF(V597=\"Int Control\",IF(E597=\"\",\"\",IF(OR(I597>0,H597=\"Enter Watts\"),I597*G597/1000*(1-$E$15),H597*G597/1000*(1-$E$15))),IF(E597=\"\",\"\",IF(OR(I597>0,H597=\"Enter Watts\"),I597*G597/1000,H597*G597/1000)))","v":""},{"$f":"IF(AND(R597=\"Interior\",S597=\"Yes\"),\"Int Control\",0)","v":{"v":0,"d":"0.0000"}},{"$f":"IFERROR(IF(V597=\"Int Control\",IF(E597=\"\",\"\",G597/1000*(1-$E$15)*IF(OR(I597>0,H597=\"Enter Watts\"),I597,H597)*IF(R597=\"Exterior\",$X$1041*(1-$G$15),IF($E$8=\"Manual Input\",J597,VLOOKUP($E$7,$W$1036:$Z$1040,2,FALSE)*(1-$E$15)))),IF(E597=\"\",\"\",G597/1000*IF(OR(I597>0,H597=\"Enter Watts\"),I597,H597)*IF(R597=\"Exterior\",$X$1041,IF($E$8=\"Manual Input\",J597,VLOOKUP($E$7,$W$1036:$Z$1040,2,FALSE))))),\"0\")","v":""},{"$f":"IF(S597=\"No\",0,AA$1036)","v":{"v":0,"d":"0.00"}},{"$f":"IF(R597=\"Interior\",IF(AND(L597=\"\",E597=\"\"),\"\",IF(OR(P597>0,O597=\"Enter Watts\",P597=\"\"),P597*N597*(1-X597)/1000,O597*N597(1-X597)/1000)),IF(AND(E597=\"\",L597=\"\"),\"\",0))","v":""},"","","","","",null,null,{"$f":"AF597*N597","v":0},{"$nulls":3},{"$f":"IF(_xlfn.ISFORMULA(J597)=TRUE,\"No\",\"Yes\")","v":"No"}]
[null,579,{"$nulls":5},"",null,"",{"$nulls":4},"",null,"",null,"No",null,"",{"v":0,"d":"0.0000"},"",{"v":0,"d":"0.00"},{"$f":"IF(R598=\"Interior\",IF(AND(L598=\"\",E598=\"\"),\"\",IF(OR(P598>0,O598=\"Enter Watts\",P598=\"\"),P598*N598*(1-X598)/1000,O598*N598(1-X598)/1000)),IF(AND(E598=\"\",L598=\"\"),\"\",0))","v":""},"","","","","",null,null,0,{"$nulls":3},"No"]
[null,580,{"$nulls":5},"",null,"",{"$nulls":4},"",null,"",null,"No",null,"",{"v":0,"d":"0.0000"},"",{"v":0,"d":"0.00"},{"$f":"IF(R599=\"Interior\",IF(AND(L599=\"\",E599=\"\"),\"\",IF(OR(P599>0,O599=\"Enter Watts\",P599=\"\"),P599*N599*(1-X599)/1000,O599*N599(1-X599)/1000)),IF(AND(E599=\"\",L599=\"\"),\"\",0))","v":""},"","","","","",null,null,0,{"$nulls":3},"No"]
[null,581,{"$nulls":5},"",null,"",{"$nulls":4},"",null,"",null,"No",null,"",{"v":0,"d":"0.0000"},"",{"v":0,"d":"0.00"},{"$f":"IF(R600=\"Interior\",IF(AND(L600=\"\",E600=\"\"),\"\",IF(OR(P600>0,O600=\"Enter Watts\",P600=\"\"),P600*N600*(1-X600)/1000,O600*N600(1-X600)/1000)),IF(AND(E600=\"\",L600=\"\"),\"\",0))","v":""},"","","","","",null,null,0,{"$nulls":3},"No"]
[null,582,{"$nulls":5},"",null,"",{"$nulls":4},"",null,"",null,"No",null,"",{"v":0,"d":"0.0000"},"",{"v":0,"d":"0.00"},{"$f":"IF(R601=\"Interior\",IF(AND(L601=\"\",E601=\"\"),\"\",IF(OR(P601>0,O601=\"Enter Watts\",P601=\"\"),P601*N601*(1-X601)/1000,O601*N601(1-X601)/1000)),IF(AND(E601=\"\",L601=\"\"),\"\",0))","v":""},"","","","","",null,null,0,{"$nulls":3},"No"]
[null,583,{"$nulls":5},"",null,"",{"$nulls":4},"",null,"",null,"No",null,"",{"v":0,"d":"0.0000"},"",{"v":0,"d":"0.00"},{"$f":"IF(R602=\"Interior\",IF(AND(L602=\"\",E602=\"\"),\"\",IF(OR(P602>0,O602=\"Enter Watts\",P602=\"\"),P602*N602*(1-X602)/1000,O602*N602(1-X602)/1000)),IF(AND(E602=\"\",L602=\"\"),\"\",0))","v":""},"","","","","",null,null,0,{"$nulls":3},"No"]
[null,584,{"$nulls":5},"",null,"",{"$nulls":4},"",null,"",null,"No",null,"",{"v":0,"d":"0.0000"},"",{"v":0,"d":"0.00"},{"$f":"IF(R603=\"Interior\",IF(AND(L603=\"\",E603=\"\"),\"\",IF(OR(P603>0,O603=\"Enter Watts\",P603=\"\"),P603*N603*(1-X603)/1000,O603*N603(1-X603)/1000)),IF(AND(E603=\"\",L603=\"\"),\"\",0))","v":""},"","","","","",null,null,0,{"$nulls":3},"No"]
[null,585,{"$nulls":5},"",null,"",{"$nulls":4},"",null,"",null,"No",null,"",{"v":0,"d":"0.0000"},"",{"v":0,"d":"0.00"},{"$f":"IF(R604=\"Interior\",IF(AND(L604=\"\",E604=\"\"),\"\",IF(OR(P604>0,O604=\"Enter Watts\",P604=\"\"),P604*N604*(1-X604)/1000,O604*N604(1-X604)/1000)),IF(AND(E604=\"\",L604=\"\"),\"\",0))","v":""},"","","","","",null,null,0,{"$nulls":3},"No"]
[null,586,{"$nulls":5},"",null,"",{"$nulls":4},"",null,"",null,"No",null,"",{"v":0,"d":"0.0000"},"",{"v":0,"d":"0.00"},{"$f":"IF(R605=\"Interior\",IF(AND(L605=\"\",E605=\"\"),\"\",IF(OR(P605>0,O605=\"Enter Watts\",P605=\"\"),P605*N605*(1-X605)/1000,O605*N605(1-X605)/1000)),IF(AND(E605=\"\",L605=\"\"),\"\",0))","v":""},"","","","","",null,null,0,{"$nulls":3},"No"]
[null,587,{"$nulls":5},"",null,"",{"$nulls":4},"",null,"",null,"No",null,"",{"v":0,"d":"0.0000"},"",{"v":0,"d":"0.00"},{"$f":"IF(R606=\"Interior\",IF(AND(L606=\"\",E606=\"\"),\"\",IF(OR(P606>0,O606=\"Enter Watts\",P606=\"\"),P606*N606*(1-X606)/1000,O606*N606(1-X606)/1000)),IF(AND(E606=\"\",L606=\"\"),\"\",0))","v":""},"","","","","",null,null,0,{"$nulls":3},"No",{"$nulls":6},"","",null,""]
[null,588,{"$nulls":5},"",null,"",{"$nulls":4},"",null,"",null,"No",null,"",{"v":0,"d":"0.0000"},"",{"v":0,"d":"0.00"},{"$f":"IF(R607=\"Interior\",IF(AND(L607=\"\",E607=\"\"),\"\",IF(OR(P607>0,O607=\"Enter Watts\",P607=\"\"),P607*N607*(1-X607)/1000,O607*N607(1-X607)/1000)),IF(AND(E607=\"\",L607=\"\"),\"\",0))","v":""},"","","","","",null,null,0,{"$nulls":3},"No"]
[null,589,{"$nulls":5},"",null,"",{"$nulls":4},"",null,"",null,"No",null,"",{"v":0,"d":"0.0000"},"",{"v":0,"d":"0.00"},{"$f":"IF(R608=\"Interior\",IF(AND(L608=\"\",E608=\"\"),\"\",IF(OR(P608>0,O608=\"Enter Watts\",P608=\"\"),P608*N608*(1-X608)/1000,O608*N608(1-X608)/1000)),IF(AND(E608=\"\",L608=\"\"),\"\",0))","v":""},"","","","","",null,null,0,{"$nulls":3},"No"]
[null,590,{"$nulls":5},"",null,"",{"$nulls":4},"",null,"",null,"No",null,"",{"v":0,"d":"0.0000"},"",{"v":0,"d":"0.00"},{"$f":"IF(R609=\"Interior\",IF(AND(L609=\"\",E609=\"\"),\"\",IF(OR(P609>0,O609=\"Enter Watts\",P609=\"\"),P609*N609*(1-X609)/1000,O609*N609(1-X609)/1000)),IF(AND(E609=\"\",L609=\"\"),\"\",0))","v":""},"","","","","",null,null,0,{"$nulls":3},"No"]
[null,591,{"$nulls":5},"",null,"",{"$nulls":4},"",null,"",null,"No",null,"",{"v":0,"d":"0.0000"},"",{"v":0,"d":"0.00"},{"$f":"IF(R610=\"Interior\",IF(AND(L610=\"\",E610=\"\"),\"\",IF(OR(P610>0,O610=\"Enter Watts\",P610=\"\"),P610*N610*(1-X610)/1000,O610*N610(1-X610)/1000)),IF(AND(E610=\"\",L610=\"\"),\"\",0))","v":""},"","","","","",null,null,0,{"$nulls":3},"No"]
[null,592,{"$nulls":5},"",null,"",{"$nulls":4},"",null,"",null,"No",null,"",{"v":0,"d":"0.0000"},"",{"v":0,"d":"0.00"},{"$f":"IF(R611=\"Interior\",IF(AND(L611=\"\",E611=\"\"),\"\",IF(OR(P611>0,O611=\"Enter Watts\",P611=\"\"),P611*N611*(1-X611)/1000,O611*N611(1-X611)/1000)),IF(AND(E611=\"\",L611=\"\"),\"\",0))","v":""},"","","","","",null,null,0,{"$nulls":3},"No"]
[null,593,{"$nulls":5},"",null,"",{"$nulls":4},"",null,"",null,"No",null,"",{"v":0,"d":"0.0000"},"",{"v":0,"d":"0.00"},{"$f":"IF(R612=\"Interior\",IF(AND(L612=\"\",E612=\"\"),\"\",IF(OR(P612>0,O612=\"Enter Watts\",P612=\"\"),P612*N612*(1-X612)/1000,O612*N612(1-X612)/1000)),IF(AND(E612=\"\",L612=\"\"),\"\",0))","v":""},"","","","","",null,null,0,{"$nulls":3},"No",{"$nulls":6},"","",null,""]
[null,594,{"$nulls":5},"",null,"",{"$nulls":4},"",null,"",null,"No",null,"",{"v":0,"d":"0.0000"},"",{"v":0,"d":"0.00"},{"$f":"IF(R613=\"Interior\",IF(AND(L613=\"\",E613=\"\"),\"\",IF(OR(P613>0,O613=\"Enter Watts\",P613=\"\"),P613*N613*(1-X613)/1000,O613*N613(1-X613)/1000)),IF(AND(E613=\"\",L613=\"\"),\"\",0))","v":""},"","","","","",null,null,0,{"$nulls":3},"No"]
[null,595,{"$nulls":5},"",null,"",{"$nulls":4},"",null,"",null,"No",null,"",{"v":0,"d":"0.0000"},"",{"v":0,"d":"0.00"},{"$f":"IF(R614=\"Interior\",IF(AND(L614=\"\",E614=\"\"),\"\",IF(OR(P614>0,O614=\"Enter Watts\",P614=\"\"),P614*N614*(1-X614)/1000,O614*N614(1-X614)/1000)),IF(AND(E614=\"\",L614=\"\"),\"\",0))","v":""},"","","","","",null,null,0,{"$nulls":3},"No"]
[null,596,{"$nulls":5},"",null,"",{"$nulls":4},"",null,"",null,"No",null,"",{"v":0,"d":"0.0000"},"",{"v":0,"d":"0.00"},{"$f":"IF(R615=\"Interior\",IF(AND(L615=\"\",E615=\"\"),\"\",IF(OR(P615>0,O615=\"Enter Watts\",P615=\"\"),P615*N615*(1-X615)/1000,O615*N615(1-X615)/1000)),IF(AND(E615=\"\",L615=\"\"),\"\",0))","v":""},"","","","","",null,null,0,{"$nulls":3},"No"]
[null,597,{"$nulls":5},"",null,"",{"$nulls":4},"",null,"",null,"No",null,"",{"v":0,"d":"0.0000"},"",{"v":0,"d":"0.00"},{"$f":"IF(R616=\"Interior\",IF(AND(L616=\"\",E616=\"\"),\"\",IF(OR(P616>0,O616=\"Enter Watts\",P616=\"\"),P616*N616*(1-X616)/1000,O616*N616(1-X616)/1000)),IF(AND(E616=\"\",L616=\"\"),\"\",0))","v":""},"","","","","",null,null,0,{"$nulls":3},"No"]
[null,598,{"$nulls":5},"",null,"",{"$nulls":4},"",null,"",null,"No",null,"",{"v":0,"d":"0.0000"},"",{"v":0,"d":"0.00"},{"$f":"IF(R617=\"Interior\",IF(AND(L617=\"\",E617=\"\"),\"\",IF(OR(P617>0,O617=\"Enter Watts\",P617=\"\"),P617*N617*(1-X617)/1000,O617*N617(1-X617)/1000)),IF(AND(E617=\"\",L617=\"\"),\"\",0))","v":""},"","","","","",null,null,0,{"$nulls":3},"No"]
[null,599,{"$nulls":5},"",null,"",{"$nulls":4},"",null,"",null,"No",null,"",{"v":0,"d":"0.0000"},"",{"v":0,"d":"0.00"},{"$f":"IF(R618=\"Interior\",IF(AND(L618=\"\",E618=\"\"),\"\",IF(OR(P618>0,O618=\"Enter Watts\",P618=\"\"),P618*N618*(1-X618)/1000,O618*N618(1-X618)/1000)),IF(AND(E618=\"\",L618=\"\"),\"\",0))","v":""},"","","","","",null,null,0,{"$nulls":3},"No"]
[null,600,{"$nulls":5},"",null,"",{"$nulls":4},"",null,"",null,"No",null,"",{"v":0,"d":"0.0000"},"",{"v":0,"d":"0.00"},{"$f":"IF(R619=\"Interior\",IF(AND(L619=\"\",E619=\"\"),\"\",IF(OR(P619>0,O619=\"Enter Watts\",P619=\"\"),P619*N619*(1-X619)/1000,O619*N619(1-X619)/1000)),IF(AND(E619=\"\",L619=\"\"),\"\",0))","v":""},"",{"$f":"IFERROR(IF(OR(I619>0,H619=\"Enter Watts\"),I619*G619,H619*G619)-IF(OR(P619>0,O619=\"Enter Watts\"),P619*N619,O619*N619),\"\")","v":""},"",{"$f":"IF(AND(W619=\"\",Z619=\"\"),\"\",IF(OR(W619=\"\",Z619=\"\"),0,W619-Z619))","v":""},"",null,null,0,{"$nulls":3},"No"]
[null,601,{"$nulls":5},"",null,"",{"$nulls":4},"",null,"",null,"No",null,"",{"v":0,"d":"0.0000"},"",{"v":0,"d":"0.00"},{"$f":"IF(R620=\"Interior\",IF(AND(L620=\"\",E620=\"\"),\"\",IF(OR(P620>0,O620=\"Enter Watts\",P620=\"\"),P620*N620*(1-X620)/1000,O620*N620(1-X620)/1000)),IF(AND(E620=\"\",L620=\"\"),\"\",0))","v":""},"",{"$f":"IFERROR(IF(OR(I620>0,H620=\"Enter Watts\"),I620*G620,H620*G620)-IF(OR(P620>0,O620=\"Enter Watts\"),P620*N620,O620*N620),\"\")","v":""},"",{"$f":"IF(AND(W620=\"\",Z620=\"\"),\"\",IF(OR(W620=\"\",Z620=\"\"),0,W620-Z620))","v":""},"",null,null,0,{"$nulls":3},"No"]
[null,602,{"$nulls":5},"",null,"",{"$nulls":4},"",null,"",null,"No",null,"",{"v":0,"d":"0.0000"},"",{"v":0,"d":"0.00"},{"$f":"IF(R621=\"Interior\",IF(AND(L621=\"\",E621=\"\"),\"\",IF(OR(P621>0,O621=\"Enter Watts\",P621=\"\"),P621*N621*(1-X621)/1000,O621*N621(1-X621)/1000)),IF(AND(E621=\"\",L621=\"\"),\"\",0))","v":""},"","","","","",null,null,0,{"$nulls":3},"No"]
[null,603,{"$nulls":5},"",null,"",{"$nulls":4},"",null,"",null,"No",null,"",{"v":0,"d":"0.0000"},"",{"v":0,"d":"0.00"},{"$f":"IF(R622=\"Interior\",IF(AND(L622=\"\",E622=\"\"),\"\",IF(OR(P622>0,O622=\"Enter Watts\",P622=\"\"),P622*N622*(1-X622)/1000,O622*N622(1-X622)/1000)),IF(AND(E622=\"\",L622=\"\"),\"\",0))","v":""},"","","","","",null,null,0,{"$nulls":3},"No"]
[null,604,{"$nulls":5},"",null,"",{"$nulls":4},"",null,"",null,"No",null,"",{"v":0,"d":"0.0000"},"",{"v":0,"d":"0.00"},{"$f":"IF(R623=\"Interior\",IF(AND(L623=\"\",E623=\"\"),\"\",IF(OR(P623>0,O623=\"Enter Watts\",P623=\"\"),P623*N623*(1-X623)/1000,O623*N623(1-X623)/1000)),IF(AND(E623=\"\",L623=\"\"),\"\",0))","v":""},"","","","","",null,null,0,{"$nulls":3},"No",{"$nulls":6},"","",null,""]
[null,605,{"$nulls":5},"",null,"",{"$nulls":4},"",null,"",null,"No",null,"",{"v":0,"d":"0.0000"},"",{"v":0,"d":"0.00"},{"$f":"IF(R624=\"Interior\",IF(AND(L624=\"\",E624=\"\"),\"\",IF(OR(P624>0,O624=\"Enter Watts\",P624=\"\"),P624*N624*(1-X624)/1000,O624*N624(1-X624)/1000)),IF(AND(E624=\"\",L624=\"\"),\"\",0))","v":""},"","","","","",null,null,0,{"$nulls":3},"No"]
[null,606,{"$nulls":5},"",null,"",{"$nulls":4},"",null,"",null,"No",null,"",{"v":0,"d":"0.0000"},"",{"v":0,"d":"0.00"},{"$f":"IF(R625=\"Interior\",IF(AND(L625=\"\",E625=\"\"),\"\",IF(OR(P625>0,O625=\"Enter Watts\",P625=\"\"),P625*N625*(1-X625)/1000,O625*N625(1-X625)/1000)),IF(AND(E625=\"\",L625=\"\"),\"\",0))","v":""},"","","","","",null,null,0,{"$nulls":3},"No"]
[null,607,{"$nulls":5},"",null,"",{"$nulls":4},"",null,"",null,"No",null,"",{"v":0,"d":"0.0000"},"",{"v":0,"d":"0.00"},{"$f":"IF(R626=\"Interior\",IF(AND(L626=\"\",E626=\"\"),\"\",IF(OR(P626>0,O626=\"Enter Watts\",P626=\"\"),P626*N626*(1-X626)/1000,O626*N626(1-X626)/1000)),IF(AND(E626=\"\",L626=\"\"),\"\",0))","v":""},"","","","","",null,null,0,{"$nulls":3},"No"]
[null,608,{"$nulls":5},"",null,"",{"$nulls":4},"",null,"",null,"No",null,"",{"v":0,"d":"0.0000"},"",{"v":0,"d":"0.00"},{"$f":"IF(R627=\"Interior\",IF(AND(L627=\"\",E627=\"\"),\"\",IF(OR(P627>0,O627=\"Enter Watts\",P627=\"\"),P627*N627*(1-X627)/1000,O627*N627(1-X627)/1000)),IF(AND(E627=\"\",L627=\"\"),\"\",0))","v":""},"","","","","",null,null,0,{"$nulls":3},"No"]
[null,609,{"$nulls":5},"",null,"",{"$nulls":4},"",null,"",null,"No",null,"",{"v":0,"d":"0.0000"},"",{"v":0,"d":"0.00"},{"$f":"IF(R628=\"Interior\",IF(AND(L628=\"\",E628=\"\"),\"\",IF(OR(P628>0,O628=\"Enter Watts\",P628=\"\"),P628*N628*(1-X628)/1000,O628*N628(1-X628)/1000)),IF(AND(E628=\"\",L628=\"\"),\"\",0))","v":""},"","","","","",null,null,0,{"$nulls":3},"No"]
[null,610,{"$nulls":5},"",null,"",{"$nulls":4},"",null,"",null,"No",null,"",{"v":0,"d":"0.0000"},"",{"v":0,"d":"0.00"},{"$f":"IF(R629=\"Interior\",IF(AND(L629=\"\",E629=\"\"),\"\",IF(OR(P629>0,O629=\"Enter Watts\",P629=\"\"),P629*N629*(1-X629)/1000,O629*N629(1-X629)/1000)),IF(AND(E629=\"\",L629=\"\"),\"\",0))","v":""},"","","","","",null,null,0,{"$nulls":3},"No",{"$nulls":6},"","",null,""]
[null,611,{"$nulls":5},"",null,"",{"$nulls":4},"",null,"",null,"No",null,"",{"v":0,"d":"0.0000"},"",{"v":0,"d":"0.00"},{"$f":"IF(R630=\"Interior\",IF(AND(L630=\"\",E630=\"\"),\"\",IF(OR(P630>0,O630=\"Enter Watts\",P630=\"\"),P630*N630*(1-X630)/1000,O630*N630(1-X630)/1000)),IF(AND(E630=\"\",L630=\"\"),\"\",0))","v":""},"","","","","",null,null,0,{"$nulls":3},"No"]
[null,612,{"$nulls":5},"",null,"",{"$nulls":4},"",null,"",null,"No",null,"",{"v":0,"d":"0.0000"},"",{"v":0,"d":"0.00"},{"$f":"IF(R631=\"Interior\",IF(AND(L631=\"\",E631=\"\"),\"\",IF(OR(P631>0,O631=\"Enter Watts\",P631=\"\"),P631*N631*(1-X631)/1000,O631*N631(1-X631)/1000)),IF(AND(E631=\"\",L631=\"\"),\"\",0))","v":""},"","","","","",null,null,0,{"$nulls":3},"No"]
[null,613,{"$nulls":5},"",null,"",{"$nulls":4},"",null,"",null,"No",null,"",{"v":0,"d":"0.0000"},"",{"v":0,"d":"0.00"},{"$f":"IF(R632=\"Interior\",IF(AND(L632=\"\",E632=\"\"),\"\",IF(OR(P632>0,O632=\"Enter Watts\",P632=\"\"),P632*N632*(1-X632)/1000,O632*N632(1-X632)/1000)),IF(AND(E632=\"\",L632=\"\"),\"\",0))","v":""},"","","","","",null,null,0,{"$nulls":3},"No"]
[null,614,{"$nulls":5},"",null,"",{"$nulls":4},"",null,"",null,"No",null,"",{"v":0,"d":"0.0000"},"",{"v":0,"d":"0.00"},{"$f":"IF(R633=\"Interior\",IF(AND(L633=\"\",E633=\"\"),\"\",IF(OR(P633>0,O633=\"Enter Watts\",P633=\"\"),P633*N633*(1-X633)/1000,O633*N633(1-X633)/1000)),IF(AND(E633=\"\",L633=\"\"),\"\",0))","v":""},"","","","","",null,null,0,{"$nulls":3},"No"]
[null,615,{"$nulls":5},"",null,"",{"$nulls":4},"",null,"",null,"No",null,"",{"v":0,"d":"0.0000"},"",{"v":0,"d":"0.00"},{"$f":"IF(R634=\"Interior\",IF(AND(L634=\"\",E634=\"\"),\"\",IF(OR(P634>0,O634=\"Enter Watts\",P634=\"\"),P634*N634*(1-X634)/1000,O634*N634(1-X634)/1000)),IF(AND(E634=\"\",L634=\"\"),\"\",0))","v":""},"","","","","",null,null,0,{"$nulls":3},"No"]
[null,616,{"$nulls":5},"",null,"",{"$nulls":4},"",null,"",null,"No",null,"",{"v":0,"d":"0.0000"},"",{"v":0,"d":"0.00"},{"$f":"IF(R635=\"Interior\",IF(AND(L635=\"\",E635=\"\"),\"\",IF(OR(P635>0,O635=\"Enter Watts\",P635=\"\"),P635*N635*(1-X635)/1000,O635*N635(1-X635)/1000)),IF(AND(E635=\"\",L635=\"\"),\"\",0))","v":""},"","","","","",null,null,0,{"$nulls":3},"No"]
[null,617,{"$nulls":5},"",null,"",{"$nulls":4},"",null,"",null,"No",null,"",{"v":0,"d":"0.0000"},"",{"v":0,"d":"0.00"},{"$f":"IF(R636=\"Interior\",IF(AND(L636=\"\",E636=\"\"),\"\",IF(OR(P636>0,O636=\"Enter Watts\",P636=\"\"),P636*N636*(1-X636)/1000,O636*N636(1-X636)/1000)),IF(AND(E636=\"\",L636=\"\"),\"\",0))","v":""},"","","","","",null,null,0,{"$nulls":3},"No",{"$nulls":6},"","",null,""]
[null,618,{"$nulls":5},"",null,"",{"$nulls":4},"",null,"",null,"No",null,"",{"v":0,"d":"0.0000"},"",{"v":0,"d":"0.00"},{"$f":"IF(R637=\"Interior\",IF(AND(L637=\"\",E637=\"\"),\"\",IF(OR(P637>0,O637=\"Enter Watts\",P637=\"\"),P637*N637*(1-X637)/1000,O637*N637(1-X637)/1000)),IF(AND(E637=\"\",L637=\"\"),\"\",0))","v":""},"","","","","",null,null,0,{"$nulls":3},"No"]
[null,619,{"$nulls":5},"",null,"",{"$nulls":4},"",null,"",null,"No",null,"",{"v":0,"d":"0.0000"},"",{"v":0,"d":"0.00"},{"$f":"IF(R638=\"Interior\",IF(AND(L638=\"\",E638=\"\"),\"\",IF(OR(P638>0,O638=\"Enter Watts\",P638=\"\"),P638*N638*(1-X638)/1000,O638*N638(1-X638)/1000)),IF(AND(E638=\"\",L638=\"\"),\"\",0))","v":""},"","","","","",null,null,0,{"$nulls":3},"No"]
[null,620,{"$nulls":5},"",null,"",{"$nulls":4},"",null,"",null,"No",null,"",{"v":0,"d":"0.0000"},"",{"v":0,"d":"0.00"},{"$f":"IF(R639=\"Interior\",IF(AND(L639=\"\",E639=\"\"),\"\",IF(OR(P639>0,O639=\"Enter Watts\",P639=\"\"),P639*N639*(1-X639)/1000,O639*N639(1-X639)/1000)),IF(AND(E639=\"\",L639=\"\"),\"\",0))","v":""},"","","","","",null,null,0,{"$nulls":3},"No"]
[null,621,{"$nulls":5},"",null,"",{"$nulls":4},"",null,"",null,"No",null,"",{"v":0,"d":"0.0000"},"",{"v":0,"d":"0.00"},{"$f":"IF(R640=\"Interior\",IF(AND(L640=\"\",E640=\"\"),\"\",IF(OR(P640>0,O640=\"Enter Watts\",P640=\"\"),P640*N640*(1-X640)/1000,O640*N640(1-X640)/1000)),IF(AND(E640=\"\",L640=\"\"),\"\",0))","v":""},"","","","","",null,null,0,{"$nulls":3},"No"]
[null,622,{"$nulls":5},{"$f":"IF(E641=\"\",\"\",VLOOKUP(E641,$AQ$1114:$AR$1541,2,FALSE))","v":""},null,"",{"$nulls":4},"",null,"",null,"No",null,"",{"v":0,"d":"0.0000"},"",{"v":0,"d":"0.00"},{"$f":"IF(R641=\"Interior\",IF(AND(L641=\"\",E641=\"\"),\"\",IF(OR(P641>0,O641=\"Enter Watts\",P641=\"\"),P641*N641*(1-X641)/1000,O641*N641(1-X641)/1000)),IF(AND(E641=\"\",L641=\"\"),\"\",0))","v":""},"","","","",{"$f":"IF(AC641=\"\",\"\",IF(AND(R641=\"Interior\",S641=\"No\",OR(T641=\"\",T641=\"No\")),$J$1027,IF(AND(R641=\"Interior\",S641=\"Yes\"),$J$1028,IF(AND(R641=\"Exterior\",S641=\"Yes\"),$J$1029,IF(AND(R641=\"Exterior\",S641=\"No\",N641<>G641),\"DNQ\",\"See Lighting Catalog to determine Code\")))))","v":""},null,null,0,{"$nulls":3},"No"]
[null,623,{"$nulls":5},"",null,"",{"$nulls":4},"",null,"",null,"No",null,"",{"v":0,"d":"0.0000"},"",{"v":0,"d":"0.00"},{"$f":"IF(R642=\"Interior\",IF(AND(L642=\"\",E642=\"\"),\"\",IF(OR(P642>0,O642=\"Enter Watts\",P642=\"\"),P642*N642*(1-X642)/1000,O642*N642(1-X642)/1000)),IF(AND(E642=\"\",L642=\"\"),\"\",0))","v":""},"","","","","",null,null,0,{"$nulls":3},"No",{"$nulls":6},"","",null,""]
[null,624,{"$nulls":5},"",null,"",{"$nulls":4},"",null,"",null,"No",null,"",{"v":0,"d":"0.0000"},"",{"v":0,"d":"0.00"},{"$f":"IF(R643=\"Interior\",IF(AND(L643=\"\",E643=\"\"),\"\",IF(OR(P643>0,O643=\"Enter Watts\",P643=\"\"),P643*N643*(1-X643)/1000,O643*N643(1-X643)/1000)),IF(AND(E643=\"\",L643=\"\"),\"\",0))","v":""},"","","","","",null,null,0,{"$nulls":3},"No"]
[null,625,{"$nulls":5},"",null,"",{"$nulls":4},"",null,"",null,"No",null,"",{"v":0,"d":"0.0000"},"",{"v":0,"d":"0.00"},{"$f":"IF(R644=\"Interior\",IF(AND(L644=\"\",E644=\"\"),\"\",IF(OR(P644>0,O644=\"Enter Watts\",P644=\"\"),P644*N644*(1-X644)/1000,O644*N644(1-X644)/1000)),IF(AND(E644=\"\",L644=\"\"),\"\",0))","v":""},"","","","","",null,null,0,{"$nulls":3},"No"]
[null,626,{"$nulls":5},"",null,"",{"$nulls":4},"",null,"",null,"No",null,"",{"v":0,"d":"0.0000"},"",{"v":0,"d":"0.00"},{"$f":"IF(R645=\"Interior\",IF(AND(L645=\"\",E645=\"\"),\"\",IF(OR(P645>0,O645=\"Enter Watts\",P645=\"\"),P645*N645*(1-X645)/1000,O645*N645(1-X645)/1000)),IF(AND(E645=\"\",L645=\"\"),\"\",0))","v":""},"","","","","",null,null,0,{"$nulls":3},"No"]
[null,627,{"$nulls":5},"",null,"",{"$nulls":4},"",null,"",null,"No",null,"",{"v":0,"d":"0.0000"},"",{"v":0,"d":"0.00"},{"$f":"IF(R646=\"Interior\",IF(AND(L646=\"\",E646=\"\"),\"\",IF(OR(P646>0,O646=\"Enter Watts\",P646=\"\"),P646*N646*(1-X646)/1000,O646*N646(1-X646)/1000)),IF(AND(E646=\"\",L646=\"\"),\"\",0))","v":""},"","","","","",null,null,0,{"$nulls":3},"No"]
[null,628,{"$nulls":5},"",null,"",{"$nulls":4},"",null,"",null,"No",null,"",{"v":0,"d":"0.0000"},"",{"v":0,"d":"0.00"},{"$f":"IF(R647=\"Interior\",IF(AND(L647=\"\",E647=\"\"),\"\",IF(OR(P647>0,O647=\"Enter Watts\",P647=\"\"),P647*N647*(1-X647)/1000,O647*N647(1-X647)/1000)),IF(AND(E647=\"\",L647=\"\"),\"\",0))","v":""},"","","","","",null,null,0,{"$nulls":3},"No"]
[null,629,{"$nulls":5},"",null,"",{"$nulls":4},"",null,"",null,"No",null,"",{"v":0,"d":"0.0000"},"",{"v":0,"d":"0.00"},{"$f":"IF(R648=\"Interior\",IF(AND(L648=\"\",E648=\"\"),\"\",IF(OR(P648>0,O648=\"Enter Watts\",P648=\"\"),P648*N648*(1-X648)/1000,O648*N648(1-X648)/1000)),IF(AND(E648=\"\",L648=\"\"),\"\",0))","v":""},"","","","","",null,null,0,{"$nulls":3},"No"]
[null,630,{"$nulls":5},"",null,"",{"$nulls":4},"",null,"",null,"No",null,"",{"v":0,"d":"0.0000"},"",{"v":0,"d":"0.00"},{"$f":"IF(R649=\"Interior\",IF(AND(L649=\"\",E649=\"\"),\"\",IF(OR(P649>0,O649=\"Enter Watts\",P649=\"\"),P649*N649*(1-X649)/1000,O649*N649(1-X649)/1000)),IF(AND(E649=\"\",L649=\"\"),\"\",0))","v":""},"","","","","",null,null,0,{"$nulls":3},"No"]
[null,631,{"$nulls":5},"",null,"",{"$nulls":4},"",null,"",null,"No",null,"",{"v":0,"d":"0.0000"},"",{"v":0,"d":"0.00"},{"$f":"IF(R650=\"Interior\",IF(AND(L650=\"\",E650=\"\"),\"\",IF(OR(P650>0,O650=\"Enter Watts\",P650=\"\"),P650*N650*(1-X650)/1000,O650*N650(1-X650)/1000)),IF(AND(E650=\"\",L650=\"\"),\"\",0))","v":""},"","","","","",null,null,0,{"$nulls":3},"No"]
[null,632,{"$nulls":5},"",null,"",{"$nulls":4},"",null,"",null,"No",null,"",{"v":0,"d":"0.0000"},"",{"v":0,"d":"0.00"},{"$f":"IF(R651=\"Interior\",IF(AND(L651=\"\",E651=\"\"),\"\",IF(OR(P651>0,O651=\"Enter Watts\",P651=\"\"),P651*N651*(1-X651)/1000,O651*N651(1-X651)/1000)),IF(AND(E651=\"\",L651=\"\"),\"\",0))","v":""},"","","","","",null,null,0,{"$nulls":3},"No"]
[null,633,{"$nulls":5},"",null,"",{"$nulls":4},"",null,"",null,"No",null,"",{"v":0,"d":"0.0000"},"",{"v":0,"d":"0.00"},{"$f":"IF(R652=\"Interior\",IF(AND(L652=\"\",E652=\"\"),\"\",IF(OR(P652>0,O652=\"Enter Watts\",P652=\"\"),P652*N652*(1-X652)/1000,O652*N652(1-X652)/1000)),IF(AND(E652=\"\",L652=\"\"),\"\",0))","v":""},"","","","","",null,null,0,{"$nulls":3},"No"]
[null,634,{"$nulls":5},"",null,"",{"$nulls":4},"",null,"",null,"No",null,"",{"v":0,"d":"0.0000"},"",{"v":0,"d":"0.00"},{"$f":"IF(R653=\"Interior\",IF(AND(L653=\"\",E653=\"\"),\"\",IF(OR(P653>0,O653=\"Enter Watts\",P653=\"\"),P653*N653*(1-X653)/1000,O653*N653(1-X653)/1000)),IF(AND(E653=\"\",L653=\"\"),\"\",0))","v":""},"","","","","",null,null,0,{"$nulls":3},"No"]
[null,635,{"$nulls":5},"",null,"",{"$nulls":4},"",null,"",null,"No",null,"",{"v":0,"d":"0.0000"},"",{"v":0,"d":"0.00"},{"$f":"IF(R654=\"Interior\",IF(AND(L654=\"\",E654=\"\"),\"\",IF(OR(P654>0,O654=\"Enter Watts\",P654=\"\"),P654*N654*(1-X654)/1000,O654*N654(1-X654)/1000)),IF(AND(E654=\"\",L654=\"\"),\"\",0))","v":""},"","","","","",null,null,0,{"$nulls":3},"No",{"$nulls":6},"","",null,""]
[null,636,{"$nulls":5},"",null,"",{"$nulls":4},"",null,"",null,"No",null,"",{"v":0,"d":"0.0000"},"",{"v":0,"d":"0.00"},{"$f":"IF(R655=\"Interior\",IF(AND(L655=\"\",E655=\"\"),\"\",IF(OR(P655>0,O655=\"Enter Watts\",P655=\"\"),P655*N655*(1-X655)/1000,O655*N655(1-X655)/1000)),IF(AND(E655=\"\",L655=\"\"),\"\",0))","v":""},"","","","","",null,null,0,{"$nulls":3},"No"]
[null,637,{"$nulls":5},"",null,"",{"$nulls":4},"",null,"",null,"No",null,"",{"v":0,"d":"0.0000"},"",{"v":0,"d":"0.00"},{"$f":"IF(R656=\"Interior\",IF(AND(L656=\"\",E656=\"\"),\"\",IF(OR(P656>0,O656=\"Enter Watts\",P656=\"\"),P656*N656*(1-X656)/1000,O656*N656(1-X656)/1000)),IF(AND(E656=\"\",L656=\"\"),\"\",0))","v":""},"","","","","",null,null,0,{"$nulls":3},"No"]
[null,638,{"$nulls":5},"",null,"",{"$nulls":4},"",null,"",null,"No",null,"",{"v":0,"d":"0.0000"},"",{"v":0,"d":"0.00"},{"$f":"IF(R657=\"Interior\",IF(AND(L657=\"\",E657=\"\"),\"\",IF(OR(P657>0,O657=\"Enter Watts\",P657=\"\"),P657*N657*(1-X657)/1000,O657*N657(1-X657)/1000)),IF(AND(E657=\"\",L657=\"\"),\"\",0))","v":""},"","","","","",null,null,0,{"$nulls":3},"No"]
[null,639,{"$nulls":5},"",null,"",{"$nulls":4},"",null,"",null,"No",null,"",{"v":0,"d":"0.0000"},"",{"v":0,"d":"0.00"},{"$f":"IF(R658=\"Interior\",IF(AND(L658=\"\",E658=\"\"),\"\",IF(OR(P658>0,O658=\"Enter Watts\",P658=\"\"),P658*N658*(1-X658)/1000,O658*N658(1-X658)/1000)),IF(AND(E658=\"\",L658=\"\"),\"\",0))","v":""},"","","","","",null,null,0,{"$nulls":3},"No"]
[null,640,{"$nulls":5},"",null,"",{"$nulls":4},"",null,"",null,"No",null,"",{"v":0,"d":"0.0000"},"",{"v":0,"d":"0.00"},{"$f":"IF(R659=\"Interior\",IF(AND(L659=\"\",E659=\"\"),\"\",IF(OR(P659>0,O659=\"Enter Watts\",P659=\"\"),P659*N659*(1-X659)/1000,O659*N659(1-X659)/1000)),IF(AND(E659=\"\",L659=\"\"),\"\",0))","v":""},"","","","","",null,null,0,{"$nulls":3},"No"]
[null,641,{"$nulls":5},"",null,{"$f":"IF(AND(E660<>\"\",G660<>\"\",$E$8=\"Default Sector Hours\"),VLOOKUP(IF(R660=\"Exterior\",\"Exterior\",$E$7),$W$1036:$X$1041,2,FALSE),\"\")","v":""},{"$nulls":4},{"$f":"IF(L660=\"\",\"\",VLOOKUP(L660,$AQ$1113:$AR$1541,2,FALSE))","v":""},null,"",null,"No",null,"",{"v":0,"d":"0.0000"},"",{"v":0,"d":"0.00"},{"$f":"IF(R660=\"Interior\",IF(AND(L660=\"\",E660=\"\"),\"\",IF(OR(P660>0,O660=\"Enter Watts\",P660=\"\"),P660*N660*(1-X660)/1000,O660*N660(1-X660)/1000)),IF(AND(E660=\"\",L660=\"\"),\"\",0))","v":""},{"$f":"IFERROR(IF(AND(L660=\"\", E660=\"\"),\"\",N660/1000*IF(OR(P660>0,O660=\"Enter Watts\"),P660,O660)*IF(R660=\"Exterior\",$X$1041,IF($E$8=\"Manual Input\",Q660,VLOOKUP($E$7,$W$1036:$Z$1040,2,FALSE)))*IF(S660=\"Yes\",IF(R660=\"Exterior\",1-$Z$1041,1-VLOOKUP($E$7,$W$1036:$Z$1040,4,FALSE)),1)),0)","v":""},"",{"$f":"IF(AND(U660=\"\",Y660=\"\"),\"\",IF(OR(U660=\"\",Y660=\"\"),0,  IF($E$8=\"Manual Input\",$G$9,   VLOOKUP($E$7,$W$1036:$Z$1041,3,FALSE))     *(U660-Y660)))","v":""},"","",null,null,0,{"$nulls":3},"No",{"$nulls":6},"","",null,""]
[null,642,{"$nulls":5},"",null,"",{"$nulls":4},"",null,"",null,"No",null,{"$f":"IF(V661=\"Int Control\",IF(E661=\"\",\"\",IF(OR(I661>0,H661=\"Enter Watts\"),I661*G661/1000*(1-$E$15),H661*G661/1000*(1-$E$15))),IF(E661=\"\",\"\",IF(OR(I661>0,H661=\"Enter Watts\"),I661*G661/1000,H661*G661/1000)))","v":""},{"$f":"IF(AND(R661=\"Interior\",S661=\"Yes\"),\"Int Control\",0)","v":{"v":0,"d":"0.0000"}},{"$f":"IFERROR(IF(V661=\"Int Control\",IF(E661=\"\",\"\",G661/1000*(1-$E$15)*IF(OR(I661>0,H661=\"Enter Watts\"),I661,H661)*IF(R661=\"Exterior\",$X$1041*(1-$G$15),IF($E$8=\"Manual Input\",J661,VLOOKUP($E$7,$W$1036:$Z$1040,2,FALSE)*(1-$E$15)))),IF(E661=\"\",\"\",G661/1000*IF(OR(I661>0,H661=\"Enter Watts\"),I661,H661)*IF(R661=\"Exterior\",$X$1041,IF($E$8=\"Manual Input\",J661,VLOOKUP($E$7,$W$1036:$Z$1040,2,FALSE))))),\"0\")","v":""},{"$f":"IF(S661=\"No\",0,AA$1036)","v":{"v":0,"d":"0.00"}},{"$f":"IF(R661=\"Interior\",IF(AND(L661=\"\",E661=\"\"),\"\",IF(OR(P661>0,O661=\"Enter Watts\",P661=\"\"),P661*N661*(1-X661)/1000,O661*N661(1-X661)/1000)),IF(AND(E661=\"\",L661=\"\"),\"\",0))","v":""},"","","","","",null,null,{"$f":"AF661*N661","v":0},{"$nulls":3},{"$f":"IF(_xlfn.ISFORMULA(J661)=TRUE,\"No\",\"Yes\")","v":"No"}]
[null,643,{"$nulls":5},"",null,"",{"$nulls":4},"",null,"",null,"No",null,"",{"v":0,"d":"0.0000"},"",{"v":0,"d":"0.00"},{"$f":"IF(R662=\"Interior\",IF(AND(L662=\"\",E662=\"\"),\"\",IF(OR(P662>0,O662=\"Enter Watts\",P662=\"\"),P662*N662*(1-X662)/1000,O662*N662(1-X662)/1000)),IF(AND(E662=\"\",L662=\"\"),\"\",0))","v":""},"","","","","",null,null,0,{"$nulls":3},"No"]
[null,644,{"$nulls":5},"",null,"",{"$nulls":4},"",null,"",null,"No",null,"",{"v":0,"d":"0.0000"},"",{"v":0,"d":"0.00"},{"$f":"IF(R663=\"Interior\",IF(AND(L663=\"\",E663=\"\"),\"\",IF(OR(P663>0,O663=\"Enter Watts\",P663=\"\"),P663*N663*(1-X663)/1000,O663*N663(1-X663)/1000)),IF(AND(E663=\"\",L663=\"\"),\"\",0))","v":""},"","","","","",null,null,0,{"$nulls":3},"No"]
[null,645,{"$nulls":5},"",null,"",{"$nulls":4},"",null,"",null,"No",null,"",{"v":0,"d":"0.0000"},"",{"v":0,"d":"0.00"},{"$f":"IF(R664=\"Interior\",IF(AND(L664=\"\",E664=\"\"),\"\",IF(OR(P664>0,O664=\"Enter Watts\",P664=\"\"),P664*N664*(1-X664)/1000,O664*N664(1-X664)/1000)),IF(AND(E664=\"\",L664=\"\"),\"\",0))","v":""},"","","","","",null,null,0,{"$nulls":3},"No"]
[null,646,{"$nulls":5},"",null,"",{"$nulls":4},"",null,"",null,"No",null,"",{"v":0,"d":"0.0000"},"",{"v":0,"d":"0.00"},{"$f":"IF(R665=\"Interior\",IF(AND(L665=\"\",E665=\"\"),\"\",IF(OR(P665>0,O665=\"Enter Watts\",P665=\"\"),P665*N665*(1-X665)/1000,O665*N665(1-X665)/1000)),IF(AND(E665=\"\",L665=\"\"),\"\",0))","v":""},"","","","","",null,null,0,{"$nulls":3},"No"]
[null,647,{"$nulls":5},"",null,"",{"$nulls":4},"",null,"",null,"No",null,"",{"v":0,"d":"0.0000"},"",{"v":0,"d":"0.00"},{"$f":"IF(R666=\"Interior\",IF(AND(L666=\"\",E666=\"\"),\"\",IF(OR(P666>0,O666=\"Enter Watts\",P666=\"\"),P666*N666*(1-X666)/1000,O666*N666(1-X666)/1000)),IF(AND(E666=\"\",L666=\"\"),\"\",0))","v":""},"","","","","",null,null,0,{"$nulls":3},"No"]
[null,648,{"$nulls":5},"",null,"",{"$nulls":4},"",null,"",null,"No",null,"",{"v":0,"d":"0.0000"},"",{"v":0,"d":"0.00"},{"$f":"IF(R667=\"Interior\",IF(AND(L667=\"\",E667=\"\"),\"\",IF(OR(P667>0,O667=\"Enter Watts\",P667=\"\"),P667*N667*(1-X667)/1000,O667*N667(1-X667)/1000)),IF(AND(E667=\"\",L667=\"\"),\"\",0))","v":""},"",{"$f":"IFERROR(IF(OR(I667>0,H667=\"Enter Watts\"),I667*G667,H667*G667)-IF(OR(P667>0,O667=\"Enter Watts\"),P667*N667,O667*N667),\"\")","v":""},"",{"$f":"IF(AND(W667=\"\",Z667=\"\"),\"\",IF(OR(W667=\"\",Z667=\"\"),0,W667-Z667))","v":""},"",null,null,0,{"$nulls":3},"No"]
[null,649,{"$nulls":5},"",null,"",{"$nulls":4},"",null,"",null,"No",null,"",{"v":0,"d":"0.0000"},"",{"v":0,"d":"0.00"},{"$f":"IF(R668=\"Interior\",IF(AND(L668=\"\",E668=\"\"),\"\",IF(OR(P668>0,O668=\"Enter Watts\",P668=\"\"),P668*N668*(1-X668)/1000,O668*N668(1-X668)/1000)),IF(AND(E668=\"\",L668=\"\"),\"\",0))","v":""},"",{"$f":"IFERROR(IF(OR(I668>0,H668=\"Enter Watts\"),I668*G668,H668*G668)-IF(OR(P668>0,O668=\"Enter Watts\"),P668*N668,O668*N668),\"\")","v":""},"",{"$f":"IF(AND(W668=\"\",Z668=\"\"),\"\",IF(OR(W668=\"\",Z668=\"\"),0,W668-Z668))","v":""},"",null,null,0,{"$nulls":3},"No"]
[null,650,{"$nulls":5},"",null,"",{"$nulls":4},"",null,"",null,"No",null,"",{"v":0,"d":"0.0000"},"",{"v":0,"d":"0.00"},{"$f":"IF(R669=\"Interior\",IF(AND(L669=\"\",E669=\"\"),\"\",IF(OR(P669>0,O669=\"Enter Watts\",P669=\"\"),P669*N669*(1-X669)/1000,O669*N669(1-X669)/1000)),IF(AND(E669=\"\",L669=\"\"),\"\",0))","v":""},"","","","","",null,null,0,{"$nulls":3},"No"]
[null,651,{"$nulls":5},"",null,"",{"$nulls":4},"",null,"",null,"No",null,"",{"v":0,"d":"0.0000"},"",{"v":0,"d":"0.00"},{"$f":"IF(R670=\"Interior\",IF(AND(L670=\"\",E670=\"\"),\"\",IF(OR(P670>0,O670=\"Enter Watts\",P670=\"\"),P670*N670*(1-X670)/1000,O670*N670(1-X670)/1000)),IF(AND(E670=\"\",L670=\"\"),\"\",0))","v":""},"","","","","",null,null,0,{"$nulls":3},"No"]
[null,652,{"$nulls":5},"",null,"",{"$nulls":4},"",null,"",null,"No",null,"",{"v":0,"d":"0.0000"},"",{"v":0,"d":"0.00"},{"$f":"IF(R671=\"Interior\",IF(AND(L671=\"\",E671=\"\"),\"\",IF(OR(P671>0,O671=\"Enter Watts\",P671=\"\"),P671*N671*(1-X671)/1000,O671*N671(1-X671)/1000)),IF(AND(E671=\"\",L671=\"\"),\"\",0))","v":""},"","","","","",null,null,0,{"$nulls":3},"No",{"$nulls":6},"","",null,""]
[null,653,{"$nulls":5},"",null,"",{"$nulls":4},"",null,"",null,"No",null,"",{"v":0,"d":"0.0000"},"",{"v":0,"d":"0.00"},{"$f":"IF(R672=\"Interior\",IF(AND(L672=\"\",E672=\"\"),\"\",IF(OR(P672>0,O672=\"Enter Watts\",P672=\"\"),P672*N672*(1-X672)/1000,O672*N672(1-X672)/1000)),IF(AND(E672=\"\",L672=\"\"),\"\",0))","v":""},"","","","","",null,null,0,{"$nulls":3},"No"]
[null,654,{"$nulls":5},"",null,"",{"$nulls":4},"",null,"",null,"No",null,"",{"v":0,"d":"0.0000"},"",{"v":0,"d":"0.00"},{"$f":"IF(R673=\"Interior\",IF(AND(L673=\"\",E673=\"\"),\"\",IF(OR(P673>0,O673=\"Enter Watts\",P673=\"\"),P673*N673*(1-X673)/1000,O673*N673(1-X673)/1000)),IF(AND(E673=\"\",L673=\"\"),\"\",0))","v":""},"","","","","",null,null,0,{"$nulls":3},"No"]
[null,655,{"$nulls":5},"",null,"",{"$nulls":4},"",null,"",null,"No",null,"",{"v":0,"d":"0.0000"},"",{"v":0,"d":"0.00"},{"$f":"IF(R674=\"Interior\",IF(AND(L674=\"\",E674=\"\"),\"\",IF(OR(P674>0,O674=\"Enter Watts\",P674=\"\"),P674*N674*(1-X674)/1000,O674*N674(1-X674)/1000)),IF(AND(E674=\"\",L674=\"\"),\"\",0))","v":""},"","","","","",null,null,0,{"$nulls":3},"No"]
[null,656,{"$nulls":5},"",null,"",{"$nulls":4},"",null,"",null,"No",null,"",{"v":0,"d":"0.0000"},"",{"v":0,"d":"0.00"},{"$f":"IF(R675=\"Interior\",IF(AND(L675=\"\",E675=\"\"),\"\",IF(OR(P675>0,O675=\"Enter Watts\",P675=\"\"),P675*N675*(1-X675)/1000,O675*N675(1-X675)/1000)),IF(AND(E675=\"\",L675=\"\"),\"\",0))","v":""},"","","","","",null,null,0,{"$nulls":3},"No"]
[null,657,{"$nulls":5},"",null,"",{"$nulls":4},"",null,"",null,"No",null,"",{"v":0,"d":"0.0000"},"",{"v":0,"d":"0.00"},{"$f":"IF(R676=\"Interior\",IF(AND(L676=\"\",E676=\"\"),\"\",IF(OR(P676>0,O676=\"Enter Watts\",P676=\"\"),P676*N676*(1-X676)/1000,O676*N676(1-X676)/1000)),IF(AND(E676=\"\",L676=\"\"),\"\",0))","v":""},"","","","","",null,null,0,{"$nulls":3},"No"]
[null,658,{"$nulls":5},"",null,"",{"$nulls":4},"",null,"",null,"No",null,"",{"v":0,"d":"0.0000"},"",{"v":0,"d":"0.00"},{"$f":"IF(R677=\"Interior\",IF(AND(L677=\"\",E677=\"\"),\"\",IF(OR(P677>0,O677=\"Enter Watts\",P677=\"\"),P677*N677*(1-X677)/1000,O677*N677(1-X677)/1000)),IF(AND(E677=\"\",L677=\"\"),\"\",0))","v":""},"","","","","",null,null,0,{"$nulls":3},"No",{"$nulls":6},"","",null,""]
[null,659,{"$nulls":5},"",null,"",{"$nulls":4},"",null,"",null,"No",null,"",{"v":0,"d":"0.0000"},"",{"v":0,"d":"0.00"},{"$f":"IF(R678=\"Interior\",IF(AND(L678=\"\",E678=\"\"),\"\",IF(OR(P678>0,O678=\"Enter Watts\",P678=\"\"),P678*N678*(1-X678)/1000,O678*N678(1-X678)/1000)),IF(AND(E678=\"\",L678=\"\"),\"\",0))","v":""},"","","","","",null,null,0,{"$nulls":3},"No"]
[null,660,{"$nulls":5},"",null,"",{"$nulls":4},"",null,"",null,"No",null,"",{"v":0,"d":"0.0000"},"",{"v":0,"d":"0.00"},{"$f":"IF(R679=\"Interior\",IF(AND(L679=\"\",E679=\"\"),\"\",IF(OR(P679>0,O679=\"Enter Watts\",P679=\"\"),P679*N679*(1-X679)/1000,O679*N679(1-X679)/1000)),IF(AND(E679=\"\",L679=\"\"),\"\",0))","v":""},"","","","","",null,null,0,{"$nulls":3},"No"]
[null,661,{"$nulls":5},"",null,"",{"$nulls":4},"",null,"",null,"No",null,"",{"v":0,"d":"0.0000"},"",{"v":0,"d":"0.00"},{"$f":"IF(R680=\"Interior\",IF(AND(L680=\"\",E680=\"\"),\"\",IF(OR(P680>0,O680=\"Enter Watts\",P680=\"\"),P680*N680*(1-X680)/1000,O680*N680(1-X680)/1000)),IF(AND(E680=\"\",L680=\"\"),\"\",0))","v":""},"","","","","",null,null,0,{"$nulls":3},"No"]
[null,662,{"$nulls":5},"",null,"",{"$nulls":4},"",null,"",null,"No",null,"",{"v":0,"d":"0.0000"},"",{"v":0,"d":"0.00"},{"$f":"IF(R681=\"Interior\",IF(AND(L681=\"\",E681=\"\"),\"\",IF(OR(P681>0,O681=\"Enter Watts\",P681=\"\"),P681*N681*(1-X681)/1000,O681*N681(1-X681)/1000)),IF(AND(E681=\"\",L681=\"\"),\"\",0))","v":""},"","","","","",null,null,0,{"$nulls":3},"No"]
[null,663,{"$nulls":5},"",null,"",{"$nulls":4},"",null,"",null,"No",null,"",{"v":0,"d":"0.0000"},"",{"v":0,"d":"0.00"},{"$f":"IF(R682=\"Interior\",IF(AND(L682=\"\",E682=\"\"),\"\",IF(OR(P682>0,O682=\"Enter Watts\",P682=\"\"),P682*N682*(1-X682)/1000,O682*N682(1-X682)/1000)),IF(AND(E682=\"\",L682=\"\"),\"\",0))","v":""},"","","","","",null,null,0,{"$nulls":3},"No"]
[null,664,{"$nulls":5},"",null,"",{"$nulls":4},"",null,"",null,"No",null,"",{"v":0,"d":"0.0000"},"",{"v":0,"d":"0.00"},{"$f":"IF(R683=\"Interior\",IF(AND(L683=\"\",E683=\"\"),\"\",IF(OR(P683>0,O683=\"Enter Watts\",P683=\"\"),P683*N683*(1-X683)/1000,O683*N683(1-X683)/1000)),IF(AND(E683=\"\",L683=\"\"),\"\",0))","v":""},"","","","","",null,null,0,{"$nulls":3},"No"]
[null,665,{"$nulls":5},"",null,"",{"$nulls":4},"",null,"",null,"No",null,"",{"v":0,"d":"0.0000"},"",{"v":0,"d":"0.00"},{"$f":"IF(R684=\"Interior\",IF(AND(L684=\"\",E684=\"\"),\"\",IF(OR(P684>0,O684=\"Enter Watts\",P684=\"\"),P684*N684*(1-X684)/1000,O684*N684(1-X684)/1000)),IF(AND(E684=\"\",L684=\"\"),\"\",0))","v":""},"","","","","",null,null,0,{"$nulls":3},"No",{"$nulls":6},"","",null,""]
[null,666,{"$nulls":5},"",null,"",{"$nulls":4},"",null,"",null,"No",null,"",{"v":0,"d":"0.0000"},"",{"v":0,"d":"0.00"},{"$f":"IF(R685=\"Interior\",IF(AND(L685=\"\",E685=\"\"),\"\",IF(OR(P685>0,O685=\"Enter Watts\",P685=\"\"),P685*N685*(1-X685)/1000,O685*N685(1-X685)/1000)),IF(AND(E685=\"\",L685=\"\"),\"\",0))","v":""},"","","","","",null,null,0,{"$nulls":3},"No"]
[null,667,{"$nulls":5},"",null,"",{"$nulls":4},"",null,"",null,"No",null,"",{"v":0,"d":"0.0000"},"",{"v":0,"d":"0.00"},{"$f":"IF(R686=\"Interior\",IF(AND(L686=\"\",E686=\"\"),\"\",IF(OR(P686>0,O686=\"Enter Watts\",P686=\"\"),P686*N686*(1-X686)/1000,O686*N686(1-X686)/1000)),IF(AND(E686=\"\",L686=\"\"),\"\",0))","v":""},"","","","","",null,null,0,{"$nulls":3},"No"]
[null,668,{"$nulls":5},"",null,"",{"$nulls":4},"",null,"",null,"No",null,"",{"v":0,"d":"0.0000"},"",{"v":0,"d":"0.00"},{"$f":"IF(R687=\"Interior\",IF(AND(L687=\"\",E687=\"\"),\"\",IF(OR(P687>0,O687=\"Enter Watts\",P687=\"\"),P687*N687*(1-X687)/1000,O687*N687(1-X687)/1000)),IF(AND(E687=\"\",L687=\"\"),\"\",0))","v":""},"","","","","",null,null,0,{"$nulls":3},"No"]
[null,669,{"$nulls":5},"",null,"",{"$nulls":4},"",null,"",null,"No",null,"",{"v":0,"d":"0.0000"},"",{"v":0,"d":"0.00"},{"$f":"IF(R688=\"Interior\",IF(AND(L688=\"\",E688=\"\"),\"\",IF(OR(P688>0,O688=\"Enter Watts\",P688=\"\"),P688*N688*(1-X688)/1000,O688*N688(1-X688)/1000)),IF(AND(E688=\"\",L688=\"\"),\"\",0))","v":""},"","","","","",null,null,0,{"$nulls":3},"No"]
[null,670,{"$nulls":5},"",null,"",{"$nulls":4},"",null,"",null,"No",null,"",{"v":0,"d":"0.0000"},"",{"v":0,"d":"0.00"},{"$f":"IF(R689=\"Interior\",IF(AND(L689=\"\",E689=\"\"),\"\",IF(OR(P689>0,O689=\"Enter Watts\",P689=\"\"),P689*N689*(1-X689)/1000,O689*N689(1-X689)/1000)),IF(AND(E689=\"\",L689=\"\"),\"\",0))","v":""},"","","","","",null,null,0,{"$nulls":3},"No"]
[null,671,{"$nulls":5},"",null,"",{"$nulls":4},"",null,"",null,"No",null,"",{"v":0,"d":"0.0000"},"",{"v":0,"d":"0.00"},{"$f":"IF(R690=\"Interior\",IF(AND(L690=\"\",E690=\"\"),\"\",IF(OR(P690>0,O690=\"Enter Watts\",P690=\"\"),P690*N690*(1-X690)/1000,O690*N690(1-X690)/1000)),IF(AND(E690=\"\",L690=\"\"),\"\",0))","v":""},"","","","","",null,null,0,{"$nulls":3},"No",{"$nulls":6},"","",null,""]
[null,672,{"$nulls":5},"",null,"",{"$nulls":4},"",null,"",null,"No",null,"",{"v":0,"d":"0.0000"},"",{"v":0,"d":"0.00"},{"$f":"IF(R691=\"Interior\",IF(AND(L691=\"\",E691=\"\"),\"\",IF(OR(P691>0,O691=\"Enter Watts\",P691=\"\"),P691*N691*(1-X691)/1000,O691*N691(1-X691)/1000)),IF(AND(E691=\"\",L691=\"\"),\"\",0))","v":""},"","","","","",null,null,0,{"$nulls":3},"No"]
[null,673,{"$nulls":5},"",null,"",{"$nulls":4},"",null,"",null,"No",null,"",{"v":0,"d":"0.0000"},"",{"v":0,"d":"0.00"},{"$f":"IF(R692=\"Interior\",IF(AND(L692=\"\",E692=\"\"),\"\",IF(OR(P692>0,O692=\"Enter Watts\",P692=\"\"),P692*N692*(1-X692)/1000,O692*N692(1-X692)/1000)),IF(AND(E692=\"\",L692=\"\"),\"\",0))","v":""},"","","","","",null,null,0,{"$nulls":3},"No"]
[null,674,{"$nulls":5},"",null,"",{"$nulls":4},"",null,"",null,"No",null,"",{"v":0,"d":"0.0000"},"",{"v":0,"d":"0.00"},{"$f":"IF(R693=\"Interior\",IF(AND(L693=\"\",E693=\"\"),\"\",IF(OR(P693>0,O693=\"Enter Watts\",P693=\"\"),P693*N693*(1-X693)/1000,O693*N693(1-X693)/1000)),IF(AND(E693=\"\",L693=\"\"),\"\",0))","v":""},"","","","","",null,null,0,{"$nulls":3},"No"]
[null,675,{"$nulls":5},"",null,"",{"$nulls":4},"",null,"",null,"No",null,"",{"v":0,"d":"0.0000"},"",{"v":0,"d":"0.00"},{"$f":"IF(R694=\"Interior\",IF(AND(L694=\"\",E694=\"\"),\"\",IF(OR(P694>0,O694=\"Enter Watts\",P694=\"\"),P694*N694*(1-X694)/1000,O694*N694(1-X694)/1000)),IF(AND(E694=\"\",L694=\"\"),\"\",0))","v":""},"","","","","",null,null,0,{"$nulls":3},"No"]
[null,676,{"$nulls":5},"",null,"",{"$nulls":4},"",null,"",null,"No",null,"",{"v":0,"d":"0.0000"},"",{"v":0,"d":"0.00"},{"$f":"IF(R695=\"Interior\",IF(AND(L695=\"\",E695=\"\"),\"\",IF(OR(P695>0,O695=\"Enter Watts\",P695=\"\"),P695*N695*(1-X695)/1000,O695*N695(1-X695)/1000)),IF(AND(E695=\"\",L695=\"\"),\"\",0))","v":""},"","","","","",null,null,0,{"$nulls":3},"No"]
[null,677,{"$nulls":5},"",null,"",{"$nulls":4},"",null,"",null,"No",null,"",{"v":0,"d":"0.0000"},"",{"v":0,"d":"0.00"},{"$f":"IF(R696=\"Interior\",IF(AND(L696=\"\",E696=\"\"),\"\",IF(OR(P696>0,O696=\"Enter Watts\",P696=\"\"),P696*N696*(1-X696)/1000,O696*N696(1-X696)/1000)),IF(AND(E696=\"\",L696=\"\"),\"\",0))","v":""},"","","","","",null,null,0,{"$nulls":3},"No"]
[null,678,{"$nulls":5},"",null,"",{"$nulls":4},"",null,"",null,"No",null,"",{"v":0,"d":"0.0000"},"",{"v":0,"d":"0.00"},{"$f":"IF(R697=\"Interior\",IF(AND(L697=\"\",E697=\"\"),\"\",IF(OR(P697>0,O697=\"Enter Watts\",P697=\"\"),P697*N697*(1-X697)/1000,O697*N697(1-X697)/1000)),IF(AND(E697=\"\",L697=\"\"),\"\",0))","v":""},"","","","","",null,null,0,{"$nulls":3},"No"]
[null,679,{"$nulls":5},"",null,"",{"$nulls":4},"",null,"",null,"No",null,"",{"v":0,"d":"0.0000"},"",{"v":0,"d":"0.00"},{"$f":"IF(R698=\"Interior\",IF(AND(L698=\"\",E698=\"\"),\"\",IF(OR(P698>0,O698=\"Enter Watts\",P698=\"\"),P698*N698*(1-X698)/1000,O698*N698(1-X698)/1000)),IF(AND(E698=\"\",L698=\"\"),\"\",0))","v":""},"","","","","",null,null,0,{"$nulls":3},"No"]
[null,680,{"$nulls":5},"",null,"",{"$nulls":4},"",null,"",null,"No",null,"",{"v":0,"d":"0.0000"},"",{"v":0,"d":"0.00"},{"$f":"IF(R699=\"Interior\",IF(AND(L699=\"\",E699=\"\"),\"\",IF(OR(P699>0,O699=\"Enter Watts\",P699=\"\"),P699*N699*(1-X699)/1000,O699*N699(1-X699)/1000)),IF(AND(E699=\"\",L699=\"\"),\"\",0))","v":""},"","","","","",null,null,0,{"$nulls":3},"No"]
[null,681,{"$nulls":5},"",null,"",{"$nulls":4},"",null,"",null,"No",null,"",{"v":0,"d":"0.0000"},"",{"v":0,"d":"0.00"},{"$f":"IF(R700=\"Interior\",IF(AND(L700=\"\",E700=\"\"),\"\",IF(OR(P700>0,O700=\"Enter Watts\",P700=\"\"),P700*N700*(1-X700)/1000,O700*N700(1-X700)/1000)),IF(AND(E700=\"\",L700=\"\"),\"\",0))","v":""},"","","","","",null,null,0,{"$nulls":3},"No"]
[null,682,{"$nulls":5},"",null,"",{"$nulls":4},"",null,"",null,"No",null,"",{"v":0,"d":"0.0000"},"",{"v":0,"d":"0.00"},{"$f":"IF(R701=\"Interior\",IF(AND(L701=\"\",E701=\"\"),\"\",IF(OR(P701>0,O701=\"Enter Watts\",P701=\"\"),P701*N701*(1-X701)/1000,O701*N701(1-X701)/1000)),IF(AND(E701=\"\",L701=\"\"),\"\",0))","v":""},"","","","","",null,null,0,{"$nulls":3},"No"]
[null,683,{"$nulls":5},"",null,"",{"$nulls":4},"",null,"",null,"No",null,"",{"v":0,"d":"0.0000"},"",{"v":0,"d":"0.00"},{"$f":"IF(R702=\"Interior\",IF(AND(L702=\"\",E702=\"\"),\"\",IF(OR(P702>0,O702=\"Enter Watts\",P702=\"\"),P702*N702*(1-X702)/1000,O702*N702(1-X702)/1000)),IF(AND(E702=\"\",L702=\"\"),\"\",0))","v":""},"","","","","",null,null,0,{"$nulls":3},"No",{"$nulls":6},"","",null,""]
[null,684,{"$nulls":5},"",null,"",{"$nulls":4},"",null,"",null,"No",null,"",{"v":0,"d":"0.0000"},"",{"v":0,"d":"0.00"},{"$f":"IF(R703=\"Interior\",IF(AND(L703=\"\",E703=\"\"),\"\",IF(OR(P703>0,O703=\"Enter Watts\",P703=\"\"),P703*N703*(1-X703)/1000,O703*N703(1-X703)/1000)),IF(AND(E703=\"\",L703=\"\"),\"\",0))","v":""},"","","","","",null,null,0,{"$nulls":3},"No"]
[null,685,{"$nulls":5},"",null,"",{"$nulls":4},"",null,"",null,"No",null,"",{"v":0,"d":"0.0000"},"",{"v":0,"d":"0.00"},{"$f":"IF(R704=\"Interior\",IF(AND(L704=\"\",E704=\"\"),\"\",IF(OR(P704>0,O704=\"Enter Watts\",P704=\"\"),P704*N704*(1-X704)/1000,O704*N704(1-X704)/1000)),IF(AND(E704=\"\",L704=\"\"),\"\",0))","v":""},"","","","","",null,null,0,{"$nulls":3},"No"]
[null,686,{"$nulls":5},{"$f":"IF(E705=\"\",\"\",VLOOKUP(E705,$AQ$1114:$AR$1541,2,FALSE))","v":""},null,"",{"$nulls":4},"",null,"",null,"No",null,"",{"v":0,"d":"0.0000"},"",{"v":0,"d":"0.00"},{"$f":"IF(R705=\"Interior\",IF(AND(L705=\"\",E705=\"\"),\"\",IF(OR(P705>0,O705=\"Enter Watts\",P705=\"\"),P705*N705*(1-X705)/1000,O705*N705(1-X705)/1000)),IF(AND(E705=\"\",L705=\"\"),\"\",0))","v":""},"","","","",{"$f":"IF(AC705=\"\",\"\",IF(AND(R705=\"Interior\",S705=\"No\",OR(T705=\"\",T705=\"No\")),$J$1027,IF(AND(R705=\"Interior\",S705=\"Yes\"),$J$1028,IF(AND(R705=\"Exterior\",S705=\"Yes\"),$J$1029,IF(AND(R705=\"Exterior\",S705=\"No\",N705<>G705),\"DNQ\",\"See Lighting Catalog to determine Code\")))))","v":""},null,null,0,{"$nulls":3},"No"]
[null,687,{"$nulls":5},"",null,"",{"$nulls":4},"",null,"",null,"No",null,"",{"v":0,"d":"0.0000"},"",{"v":0,"d":"0.00"},{"$f":"IF(R706=\"Interior\",IF(AND(L706=\"\",E706=\"\"),\"\",IF(OR(P706>0,O706=\"Enter Watts\",P706=\"\"),P706*N706*(1-X706)/1000,O706*N706(1-X706)/1000)),IF(AND(E706=\"\",L706=\"\"),\"\",0))","v":""},"","","","","",null,null,0,{"$nulls":3},"No"]
[null,688,{"$nulls":5},"",null,"",{"$nulls":4},"",null,"",null,"No",null,"",{"v":0,"d":"0.0000"},"",{"v":0,"d":"0.00"},{"$f":"IF(R707=\"Interior\",IF(AND(L707=\"\",E707=\"\"),\"\",IF(OR(P707>0,O707=\"Enter Watts\",P707=\"\"),P707*N707*(1-X707)/1000,O707*N707(1-X707)/1000)),IF(AND(E707=\"\",L707=\"\"),\"\",0))","v":""},"","","","","",null,null,0,{"$nulls":3},"No"]
[null,689,{"$nulls":5},"",null,"",{"$nulls":4},"",null,"",null,"No",null,"",{"v":0,"d":"0.0000"},"",{"v":0,"d":"0.00"},{"$f":"IF(R708=\"Interior\",IF(AND(L708=\"\",E708=\"\"),\"\",IF(OR(P708>0,O708=\"Enter Watts\",P708=\"\"),P708*N708*(1-X708)/1000,O708*N708(1-X708)/1000)),IF(AND(E708=\"\",L708=\"\"),\"\",0))","v":""},"","","","","",null,null,0,{"$nulls":3},"No",{"$nulls":6},"","",null,""]
[null,690,{"$nulls":5},"",null,"",{"$nulls":4},"",null,"",null,"No",null,"",{"v":0,"d":"0.0000"},"",{"v":0,"d":"0.00"},{"$f":"IF(R709=\"Interior\",IF(AND(L709=\"\",E709=\"\"),\"\",IF(OR(P709>0,O709=\"Enter Watts\",P709=\"\"),P709*N709*(1-X709)/1000,O709*N709(1-X709)/1000)),IF(AND(E709=\"\",L709=\"\"),\"\",0))","v":""},"","","","","",null,null,0,{"$nulls":3},"No"]
[null,691,{"$nulls":5},"",null,"",{"$nulls":4},"",null,"",null,"No",null,"",{"v":0,"d":"0.0000"},"",{"v":0,"d":"0.00"},{"$f":"IF(R710=\"Interior\",IF(AND(L710=\"\",E710=\"\"),\"\",IF(OR(P710>0,O710=\"Enter Watts\",P710=\"\"),P710*N710*(1-X710)/1000,O710*N710(1-X710)/1000)),IF(AND(E710=\"\",L710=\"\"),\"\",0))","v":""},"","","","","",null,null,0,{"$nulls":3},"No"]
[null,692,{"$nulls":5},"",null,"",{"$nulls":4},"",null,"",null,"No",null,"",{"v":0,"d":"0.0000"},"",{"v":0,"d":"0.00"},{"$f":"IF(R711=\"Interior\",IF(AND(L711=\"\",E711=\"\"),\"\",IF(OR(P711>0,O711=\"Enter Watts\",P711=\"\"),P711*N711*(1-X711)/1000,O711*N711(1-X711)/1000)),IF(AND(E711=\"\",L711=\"\"),\"\",0))","v":""},"","","","","",null,null,0,{"$nulls":3},"No"]
[null,693,{"$nulls":5},"",null,"",{"$nulls":4},"",null,"",null,"No",null,"",{"v":0,"d":"0.0000"},"",{"v":0,"d":"0.00"},{"$f":"IF(R712=\"Interior\",IF(AND(L712=\"\",E712=\"\"),\"\",IF(OR(P712>0,O712=\"Enter Watts\",P712=\"\"),P712*N712*(1-X712)/1000,O712*N712(1-X712)/1000)),IF(AND(E712=\"\",L712=\"\"),\"\",0))","v":""},"","","","","",null,null,0,{"$nulls":3},"No"]
[null,694,{"$nulls":5},"",null,"",{"$nulls":4},"",null,"",null,"No",null,"",{"v":0,"d":"0.0000"},"",{"v":0,"d":"0.00"},{"$f":"IF(R713=\"Interior\",IF(AND(L713=\"\",E713=\"\"),\"\",IF(OR(P713>0,O713=\"Enter Watts\",P713=\"\"),P713*N713*(1-X713)/1000,O713*N713(1-X713)/1000)),IF(AND(E713=\"\",L713=\"\"),\"\",0))","v":""},"","","","","",null,null,0,{"$nulls":3},"No"]
[null,695,{"$nulls":5},"",null,"",{"$nulls":4},"",null,"",null,"No",null,"",{"v":0,"d":"0.0000"},"",{"v":0,"d":"0.00"},{"$f":"IF(R714=\"Interior\",IF(AND(L714=\"\",E714=\"\"),\"\",IF(OR(P714>0,O714=\"Enter Watts\",P714=\"\"),P714*N714*(1-X714)/1000,O714*N714(1-X714)/1000)),IF(AND(E714=\"\",L714=\"\"),\"\",0))","v":""},"","","","","",null,null,0,{"$nulls":3},"No"]
[null,696,{"$nulls":5},"",null,"",{"$nulls":4},"",null,"",null,"No",null,"",{"v":0,"d":"0.0000"},"",{"v":0,"d":"0.00"},{"$f":"IF(R715=\"Interior\",IF(AND(L715=\"\",E715=\"\"),\"\",IF(OR(P715>0,O715=\"Enter Watts\",P715=\"\"),P715*N715*(1-X715)/1000,O715*N715(1-X715)/1000)),IF(AND(E715=\"\",L715=\"\"),\"\",0))","v":""},"",{"$f":"IFERROR(IF(OR(I715>0,H715=\"Enter Watts\"),I715*G715,H715*G715)-IF(OR(P715>0,O715=\"Enter Watts\"),P715*N715,O715*N715),\"\")","v":""},"",{"$f":"IF(AND(W715=\"\",Z715=\"\"),\"\",IF(OR(W715=\"\",Z715=\"\"),0,W715-Z715))","v":""},"",null,null,0,{"$nulls":3},"No"]
[null,697,{"$nulls":5},"",null,"",{"$nulls":4},"",null,"",null,"No",null,"",{"v":0,"d":"0.0000"},"",{"v":0,"d":"0.00"},{"$f":"IF(R716=\"Interior\",IF(AND(L716=\"\",E716=\"\"),\"\",IF(OR(P716>0,O716=\"Enter Watts\",P716=\"\"),P716*N716*(1-X716)/1000,O716*N716(1-X716)/1000)),IF(AND(E716=\"\",L716=\"\"),\"\",0))","v":""},"",{"$f":"IFERROR(IF(OR(I716>0,H716=\"Enter Watts\"),I716*G716,H716*G716)-IF(OR(P716>0,O716=\"Enter Watts\"),P716*N716,O716*N716),\"\")","v":""},"",{"$f":"IF(AND(W716=\"\",Z716=\"\"),\"\",IF(OR(W716=\"\",Z716=\"\"),0,W716-Z716))","v":""},"",null,null,0,{"$nulls":3},"No"]
[null,698,{"$nulls":5},"",null,"",{"$nulls":4},"",null,"",null,"No",null,"",{"v":0,"d":"0.0000"},"",{"v":0,"d":"0.00"},{"$f":"IF(R717=\"Interior\",IF(AND(L717=\"\",E717=\"\"),\"\",IF(OR(P717>0,O717=\"Enter Watts\",P717=\"\"),P717*N717*(1-X717)/1000,O717*N717(1-X717)/1000)),IF(AND(E717=\"\",L717=\"\"),\"\",0))","v":""},"","","","","",null,null,0,{"$nulls":3},"No"]
[null,699,{"$nulls":5},"",null,"",{"$nulls":4},"",null,"",null,"No",null,"",{"v":0,"d":"0.0000"},"",{"v":0,"d":"0.00"},{"$f":"IF(R718=\"Interior\",IF(AND(L718=\"\",E718=\"\"),\"\",IF(OR(P718>0,O718=\"Enter Watts\",P718=\"\"),P718*N718*(1-X718)/1000,O718*N718(1-X718)/1000)),IF(AND(E718=\"\",L718=\"\"),\"\",0))","v":""},"","","","","",null,null,0,{"$nulls":3},"No"]
[null,700,{"$nulls":5},"",null,"",{"$nulls":4},"",null,"",null,"No",null,"",{"v":0,"d":"0.0000"},"",{"v":0,"d":"0.00"},{"$f":"IF(R719=\"Interior\",IF(AND(L719=\"\",E719=\"\"),\"\",IF(OR(P719>0,O719=\"Enter Watts\",P719=\"\"),P719*N719*(1-X719)/1000,O719*N719(1-X719)/1000)),IF(AND(E719=\"\",L719=\"\"),\"\",0))","v":""},"","","","","",null,null,0,{"$nulls":3},"No",{"$nulls":6},"","",null,""]
[null,701,{"$nulls":5},"",null,"",{"$nulls":4},"",null,"",null,"No",null,"",{"v":0,"d":"0.0000"},"",{"v":0,"d":"0.00"},{"$f":"IF(R720=\"Interior\",IF(AND(L720=\"\",E720=\"\"),\"\",IF(OR(P720>0,O720=\"Enter Watts\",P720=\"\"),P720*N720*(1-X720)/1000,O720*N720(1-X720)/1000)),IF(AND(E720=\"\",L720=\"\"),\"\",0))","v":""},"","","","","",null,null,0,{"$nulls":3},"No"]
[null,702,{"$nulls":5},"",null,"",{"$nulls":4},"",null,"",null,"No",null,"",{"v":0,"d":"0.0000"},"",{"v":0,"d":"0.00"},{"$f":"IF(R721=\"Interior\",IF(AND(L721=\"\",E721=\"\"),\"\",IF(OR(P721>0,O721=\"Enter Watts\",P721=\"\"),P721*N721*(1-X721)/1000,O721*N721(1-X721)/1000)),IF(AND(E721=\"\",L721=\"\"),\"\",0))","v":""},"","","","","",null,null,0,{"$nulls":3},"No"]
[null,703,{"$nulls":5},"",null,"",{"$nulls":4},"",null,"",null,"No",null,"",{"v":0,"d":"0.0000"},"",{"v":0,"d":"0.00"},{"$f":"IF(R722=\"Interior\",IF(AND(L722=\"\",E722=\"\"),\"\",IF(OR(P722>0,O722=\"Enter Watts\",P722=\"\"),P722*N722*(1-X722)/1000,O722*N722(1-X722)/1000)),IF(AND(E722=\"\",L722=\"\"),\"\",0))","v":""},"","","","","",null,null,0,{"$nulls":3},"No"]
[null,704,{"$nulls":5},"",null,"",{"$nulls":4},"",null,"",null,"No",null,"",{"v":0,"d":"0.0000"},"",{"v":0,"d":"0.00"},{"$f":"IF(R723=\"Interior\",IF(AND(L723=\"\",E723=\"\"),\"\",IF(OR(P723>0,O723=\"Enter Watts\",P723=\"\"),P723*N723*(1-X723)/1000,O723*N723(1-X723)/1000)),IF(AND(E723=\"\",L723=\"\"),\"\",0))","v":""},"","","","","",null,null,0,{"$nulls":3},"No"]
[null,705,{"$nulls":5},"",null,{"$f":"IF(AND(E724<>\"\",G724<>\"\",$E$8=\"Default Sector Hours\"),VLOOKUP(IF(R724=\"Exterior\",\"Exterior\",$E$7),$W$1036:$X$1041,2,FALSE),\"\")","v":""},{"$nulls":4},{"$f":"IF(L724=\"\",\"\",VLOOKUP(L724,$AQ$1113:$AR$1541,2,FALSE))","v":""},null,"",null,"No",null,"",{"v":0,"d":"0.0000"},"",{"v":0,"d":"0.00"},{"$f":"IF(R724=\"Interior\",IF(AND(L724=\"\",E724=\"\"),\"\",IF(OR(P724>0,O724=\"Enter Watts\",P724=\"\"),P724*N724*(1-X724)/1000,O724*N724(1-X724)/1000)),IF(AND(E724=\"\",L724=\"\"),\"\",0))","v":""},{"$f":"IFERROR(IF(AND(L724=\"\", E724=\"\"),\"\",N724/1000*IF(OR(P724>0,O724=\"Enter Watts\"),P724,O724)*IF(R724=\"Exterior\",$X$1041,IF($E$8=\"Manual Input\",Q724,VLOOKUP($E$7,$W$1036:$Z$1040,2,FALSE)))*IF(S724=\"Yes\",IF(R724=\"Exterior\",1-$Z$1041,1-VLOOKUP($E$7,$W$1036:$Z$1040,4,FALSE)),1)),0)","v":""},"",{"$f":"IF(AND(U724=\"\",Y724=\"\"),\"\",IF(OR(U724=\"\",Y724=\"\"),0,  IF($E$8=\"Manual Input\",$G$9,   VLOOKUP($E$7,$W$1036:$Z$1041,3,FALSE))     *(U724-Y724)))","v":""},"","",null,null,0,{"$nulls":3},"No"]
[null,706,{"$nulls":5},"",null,"",{"$nulls":4},"",null,{"$f":"IF(J725=\"\",\"\",J725)","v":""},null,"No",null,{"$f":"IF(V725=\"Int Control\",IF(E725=\"\",\"\",IF(OR(I725>0,H725=\"Enter Watts\"),I725*G725/1000*(1-$E$15),H725*G725/1000*(1-$E$15))),IF(E725=\"\",\"\",IF(OR(I725>0,H725=\"Enter Watts\"),I725*G725/1000,H725*G725/1000)))","v":""},{"$f":"IF(AND(R725=\"Interior\",S725=\"Yes\"),\"Int Control\",0)","v":{"v":0,"d":"0.0000"}},{"$f":"IFERROR(IF(V725=\"Int Control\",IF(E725=\"\",\"\",G725/1000*(1-$E$15)*IF(OR(I725>0,H725=\"Enter Watts\"),I725,H725)*IF(R725=\"Exterior\",$X$1041*(1-$G$15),IF($E$8=\"Manual Input\",J725,VLOOKUP($E$7,$W$1036:$Z$1040,2,FALSE)*(1-$E$15)))),IF(E725=\"\",\"\",G725/1000*IF(OR(I725>0,H725=\"Enter Watts\"),I725,H725)*IF(R725=\"Exterior\",$X$1041,IF($E$8=\"Manual Input\",J725,VLOOKUP($E$7,$W$1036:$Z$1040,2,FALSE))))),\"0\")","v":""},{"$f":"IF(S725=\"No\",0,AA$1036)","v":{"v":0,"d":"0.00"}},{"$f":"IF(R725=\"Interior\",IF(AND(L725=\"\",E725=\"\"),\"\",IF(OR(P725>0,O725=\"Enter Watts\",P725=\"\"),P725*N725*(1-X725)/1000,O725*N725(1-X725)/1000)),IF(AND(E725=\"\",L725=\"\"),\"\",0))","v":""},"",{"$f":"IFERROR(IF(OR(I725>0,H725=\"Enter Watts\"),I725*G725,H725*G725)-IF(OR(P725>0,O725=\"Enter Watts\"),P725*N725,O725*N725),\"\")","v":""},"",{"$f":"IF(AND(W725=\"\",Z725=\"\"),\"\",IF(OR(W725=\"\",Z725=\"\"),0,W725-Z725))","v":""},"",null,null,{"$f":"AF725*N725","v":0},{"$nulls":3},{"$f":"IF(_xlfn.ISFORMULA(J725)=TRUE,\"No\",\"Yes\")","v":"No"}]
[null,707,{"$nulls":5},"",null,"",{"$nulls":4},"",null,"",null,"No",null,"",{"v":0,"d":"0.0000"},"",{"v":0,"d":"0.00"},{"$f":"IF(R726=\"Interior\",IF(AND(L726=\"\",E726=\"\"),\"\",IF(OR(P726>0,O726=\"Enter Watts\",P726=\"\"),P726*N726*(1-X726)/1000,O726*N726(1-X726)/1000)),IF(AND(E726=\"\",L726=\"\"),\"\",0))","v":""},"",{"$f":"IFERROR(IF(OR(I726>0,H726=\"Enter Watts\"),I726*G726,H726*G726)-IF(OR(P726>0,O726=\"Enter Watts\"),P726*N726,O726*N726),\"\")","v":""},"",{"$f":"IF(AND(W726=\"\",Z726=\"\"),\"\",IF(OR(W726=\"\",Z726=\"\"),0,W726-Z726))","v":""},"",null,null,0,{"$nulls":3},"No"]
[null,708,{"$nulls":5},"",null,"",{"$nulls":4},"",null,"",null,"No",null,"",{"v":0,"d":"0.0000"},"",{"v":0,"d":"0.00"},{"$f":"IF(R727=\"Interior\",IF(AND(L727=\"\",E727=\"\"),\"\",IF(OR(P727>0,O727=\"Enter Watts\",P727=\"\"),P727*N727*(1-X727)/1000,O727*N727(1-X727)/1000)),IF(AND(E727=\"\",L727=\"\"),\"\",0))","v":""},"","","","","",null,null,0,{"$nulls":3},"No"]
[null,709,{"$nulls":5},"",null,"",{"$nulls":4},"",null,"",null,"No",null,"",{"v":0,"d":"0.0000"},"",{"v":0,"d":"0.00"},{"$f":"IF(R728=\"Interior\",IF(AND(L728=\"\",E728=\"\"),\"\",IF(OR(P728>0,O728=\"Enter Watts\",P728=\"\"),P728*N728*(1-X728)/1000,O728*N728(1-X728)/1000)),IF(AND(E728=\"\",L728=\"\"),\"\",0))","v":""},"","","","","",null,null,0,{"$nulls":3},"No"]
[null,710,{"$nulls":5},"",null,"",{"$nulls":4},"",null,"",null,"No",null,"",{"v":0,"d":"0.0000"},"",{"v":0,"d":"0.00"},{"$f":"IF(R729=\"Interior\",IF(AND(L729=\"\",E729=\"\"),\"\",IF(OR(P729>0,O729=\"Enter Watts\",P729=\"\"),P729*N729*(1-X729)/1000,O729*N729(1-X729)/1000)),IF(AND(E729=\"\",L729=\"\"),\"\",0))","v":""},"","","","","",null,null,0,{"$nulls":3},"No",{"$nulls":6},"","",null,""]
[null,711,{"$nulls":5},"",null,"",{"$nulls":4},"",null,"",null,"No",null,"",{"v":0,"d":"0.0000"},"",{"v":0,"d":"0.00"},{"$f":"IF(R730=\"Interior\",IF(AND(L730=\"\",E730=\"\"),\"\",IF(OR(P730>0,O730=\"Enter Watts\",P730=\"\"),P730*N730*(1-X730)/1000,O730*N730(1-X730)/1000)),IF(AND(E730=\"\",L730=\"\"),\"\",0))","v":""},"","","","","",null,null,0,{"$nulls":3},"No"]
[null,712,{"$nulls":5},"",null,"",{"$nulls":4},"",null,"",null,"No",null,"",{"v":0,"d":"0.0000"},"",{"v":0,"d":"0.00"},{"$f":"IF(R731=\"Interior\",IF(AND(L731=\"\",E731=\"\"),\"\",IF(OR(P731>0,O731=\"Enter Watts\",P731=\"\"),P731*N731*(1-X731)/1000,O731*N731(1-X731)/1000)),IF(AND(E731=\"\",L731=\"\"),\"\",0))","v":""},"","","","","",null,null,0,{"$nulls":3},"No"]
[null,713,{"$nulls":5},"",null,"",{"$nulls":4},"",null,"",null,"No",null,"",{"v":0,"d":"0.0000"},"",{"v":0,"d":"0.00"},{"$f":"IF(R732=\"Interior\",IF(AND(L732=\"\",E732=\"\"),\"\",IF(OR(P732>0,O732=\"Enter Watts\",P732=\"\"),P732*N732*(1-X732)/1000,O732*N732(1-X732)/1000)),IF(AND(E732=\"\",L732=\"\"),\"\",0))","v":""},"","","","","",null,null,0,{"$nulls":3},"No"]
[null,714,{"$nulls":5},"",null,"",{"$nulls":4},"",null,"",null,"No",null,"",{"v":0,"d":"0.0000"},"",{"v":0,"d":"0.00"},{"$f":"IF(R733=\"Interior\",IF(AND(L733=\"\",E733=\"\"),\"\",IF(OR(P733>0,O733=\"Enter Watts\",P733=\"\"),P733*N733*(1-X733)/1000,O733*N733(1-X733)/1000)),IF(AND(E733=\"\",L733=\"\"),\"\",0))","v":""},"","","","","",null,null,0,{"$nulls":3},"No"]
[null,715,{"$nulls":5},"",null,"",{"$nulls":4},"",null,"",null,"No",null,"",{"v":0,"d":"0.0000"},"",{"v":0,"d":"0.00"},{"$f":"IF(R734=\"Interior\",IF(AND(L734=\"\",E734=\"\"),\"\",IF(OR(P734>0,O734=\"Enter Watts\",P734=\"\"),P734*N734*(1-X734)/1000,O734*N734(1-X734)/1000)),IF(AND(E734=\"\",L734=\"\"),\"\",0))","v":""},"","","","","",null,null,0,{"$nulls":3},"No"]
[null,716,{"$nulls":5},"",null,"",{"$nulls":4},"",null,"",null,"No",null,"",{"v":0,"d":"0.0000"},"",{"v":0,"d":"0.00"},{"$f":"IF(R735=\"Interior\",IF(AND(L735=\"\",E735=\"\"),\"\",IF(OR(P735>0,O735=\"Enter Watts\",P735=\"\"),P735*N735*(1-X735)/1000,O735*N735(1-X735)/1000)),IF(AND(E735=\"\",L735=\"\"),\"\",0))","v":""},"","","","","",null,null,0,{"$nulls":3},"No",{"$nulls":6},"","",null,""]
[null,717,{"$nulls":5},"",null,"",{"$nulls":4},"",null,"",null,"No",null,"",{"v":0,"d":"0.0000"},"",{"v":0,"d":"0.00"},{"$f":"IF(R736=\"Interior\",IF(AND(L736=\"\",E736=\"\"),\"\",IF(OR(P736>0,O736=\"Enter Watts\",P736=\"\"),P736*N736*(1-X736)/1000,O736*N736(1-X736)/1000)),IF(AND(E736=\"\",L736=\"\"),\"\",0))","v":""},"","","","","",null,null,0,{"$nulls":3},"No"]
[null,718,{"$nulls":5},"",null,"",{"$nulls":4},"",null,"",null,"No",null,"",{"v":0,"d":"0.0000"},"",{"v":0,"d":"0.00"},{"$f":"IF(R737=\"Interior\",IF(AND(L737=\"\",E737=\"\"),\"\",IF(OR(P737>0,O737=\"Enter Watts\",P737=\"\"),P737*N737*(1-X737)/1000,O737*N737(1-X737)/1000)),IF(AND(E737=\"\",L737=\"\"),\"\",0))","v":""},"","","","","",null,null,0,{"$nulls":3},"No"]
[null,719,{"$nulls":5},"",null,"",{"$nulls":4},"",null,"",null,"No",null,"",{"v":0,"d":"0.0000"},"",{"v":0,"d":"0.00"},{"$f":"IF(R738=\"Interior\",IF(AND(L738=\"\",E738=\"\"),\"\",IF(OR(P738>0,O738=\"Enter Watts\",P738=\"\"),P738*N738*(1-X738)/1000,O738*N738(1-X738)/1000)),IF(AND(E738=\"\",L738=\"\"),\"\",0))","v":""},"","","","","",null,null,0,{"$nulls":3},"No"]
[null,720,{"$nulls":5},"",null,"",{"$nulls":4},"",null,"",null,"No",null,"",{"v":0,"d":"0.0000"},"",{"v":0,"d":"0.00"},{"$f":"IF(R739=\"Interior\",IF(AND(L739=\"\",E739=\"\"),\"\",IF(OR(P739>0,O739=\"Enter Watts\",P739=\"\"),P739*N739*(1-X739)/1000,O739*N739(1-X739)/1000)),IF(AND(E739=\"\",L739=\"\"),\"\",0))","v":""},"","","","","",null,null,0,{"$nulls":3},"No"]
[null,721,{"$nulls":5},"",null,"",{"$nulls":4},"",null,"",null,"No",null,"",{"v":0,"d":"0.0000"},"",{"v":0,"d":"0.00"},{"$f":"IF(R740=\"Interior\",IF(AND(L740=\"\",E740=\"\"),\"\",IF(OR(P740>0,O740=\"Enter Watts\",P740=\"\"),P740*N740*(1-X740)/1000,O740*N740(1-X740)/1000)),IF(AND(E740=\"\",L740=\"\"),\"\",0))","v":""},"","","","","",null,null,0,{"$nulls":3},"No"]
[null,722,{"$nulls":5},"",null,"",{"$nulls":4},"",null,"",null,"No",null,"",{"v":0,"d":"0.0000"},"",{"v":0,"d":"0.00"},{"$f":"IF(R741=\"Interior\",IF(AND(L741=\"\",E741=\"\"),\"\",IF(OR(P741>0,O741=\"Enter Watts\",P741=\"\"),P741*N741*(1-X741)/1000,O741*N741(1-X741)/1000)),IF(AND(E741=\"\",L741=\"\"),\"\",0))","v":""},"","","","","",null,null,0,{"$nulls":3},"No"]
[null,723,{"$nulls":5},"",null,"",{"$nulls":4},"",null,"",null,"No",null,"",{"v":0,"d":"0.0000"},"",{"v":0,"d":"0.00"},{"$f":"IF(R742=\"Interior\",IF(AND(L742=\"\",E742=\"\"),\"\",IF(OR(P742>0,O742=\"Enter Watts\",P742=\"\"),P742*N742*(1-X742)/1000,O742*N742(1-X742)/1000)),IF(AND(E742=\"\",L742=\"\"),\"\",0))","v":""},"","","","","",null,null,0,{"$nulls":3},"No",{"$nulls":6},"","",null,""]
[null,724,{"$nulls":5},"",null,"",{"$nulls":4},"",null,"",null,"No",null,"",{"v":0,"d":"0.0000"},"",{"v":0,"d":"0.00"},{"$f":"IF(R743=\"Interior\",IF(AND(L743=\"\",E743=\"\"),\"\",IF(OR(P743>0,O743=\"Enter Watts\",P743=\"\"),P743*N743*(1-X743)/1000,O743*N743(1-X743)/1000)),IF(AND(E743=\"\",L743=\"\"),\"\",0))","v":""},"","","","","",null,null,0,{"$nulls":3},"No"]
[null,725,{"$nulls":5},"",null,"",{"$nulls":4},"",null,"",null,"No",null,"",{"v":0,"d":"0.0000"},"",{"v":0,"d":"0.00"},{"$f":"IF(R744=\"Interior\",IF(AND(L744=\"\",E744=\"\"),\"\",IF(OR(P744>0,O744=\"Enter Watts\",P744=\"\"),P744*N744*(1-X744)/1000,O744*N744(1-X744)/1000)),IF(AND(E744=\"\",L744=\"\"),\"\",0))","v":""},"","","","","",null,null,0,{"$nulls":3},"No"]
[null,726,{"$nulls":5},"",null,"",{"$nulls":4},"",null,"",null,"No",null,"",{"v":0,"d":"0.0000"},"",{"v":0,"d":"0.00"},{"$f":"IF(R745=\"Interior\",IF(AND(L745=\"\",E745=\"\"),\"\",IF(OR(P745>0,O745=\"Enter Watts\",P745=\"\"),P745*N745*(1-X745)/1000,O745*N745(1-X745)/1000)),IF(AND(E745=\"\",L745=\"\"),\"\",0))","v":""},"","","","","",null,null,0,{"$nulls":3},"No"]
[null,727,{"$nulls":5},"",null,"",{"$nulls":4},"",null,"",null,"No",null,"",{"v":0,"d":"0.0000"},"",{"v":0,"d":"0.00"},{"$f":"IF(R746=\"Interior\",IF(AND(L746=\"\",E746=\"\"),\"\",IF(OR(P746>0,O746=\"Enter Watts\",P746=\"\"),P746*N746*(1-X746)/1000,O746*N746(1-X746)/1000)),IF(AND(E746=\"\",L746=\"\"),\"\",0))","v":""},"","","","","",null,null,0,{"$nulls":3},"No"]
[null,728,{"$nulls":5},"",null,"",{"$nulls":4},"",null,"",null,"No",null,"",{"v":0,"d":"0.0000"},"",{"v":0,"d":"0.00"},{"$f":"IF(R747=\"Interior\",IF(AND(L747=\"\",E747=\"\"),\"\",IF(OR(P747>0,O747=\"Enter Watts\",P747=\"\"),P747*N747*(1-X747)/1000,O747*N747(1-X747)/1000)),IF(AND(E747=\"\",L747=\"\"),\"\",0))","v":""},"","","","","",null,null,0,{"$nulls":3},"No"]
[null,729,{"$nulls":5},"",null,"",{"$nulls":4},"",null,"",null,"No",null,"",{"v":0,"d":"0.0000"},"",{"v":0,"d":"0.00"},{"$f":"IF(R748=\"Interior\",IF(AND(L748=\"\",E748=\"\"),\"\",IF(OR(P748>0,O748=\"Enter Watts\",P748=\"\"),P748*N748*(1-X748)/1000,O748*N748(1-X748)/1000)),IF(AND(E748=\"\",L748=\"\"),\"\",0))","v":""},"","","","","",null,null,0,{"$nulls":3},"No",{"$nulls":6},"","",null,""]
[null,730,{"$nulls":5},"",null,"",{"$nulls":4},"",null,"",null,"No",null,"",{"v":0,"d":"0.0000"},"",{"v":0,"d":"0.00"},{"$f":"IF(R749=\"Interior\",IF(AND(L749=\"\",E749=\"\"),\"\",IF(OR(P749>0,O749=\"Enter Watts\",P749=\"\"),P749*N749*(1-X749)/1000,O749*N749(1-X749)/1000)),IF(AND(E749=\"\",L749=\"\"),\"\",0))","v":""},"","","","","",null,null,0,{"$nulls":3},"No"]
[null,731,{"$nulls":5},"",null,"",{"$nulls":4},"",null,"",null,"No",null,"",{"v":0,"d":"0.0000"},"",{"v":0,"d":"0.00"},{"$f":"IF(R750=\"Interior\",IF(AND(L750=\"\",E750=\"\"),\"\",IF(OR(P750>0,O750=\"Enter Watts\",P750=\"\"),P750*N750*(1-X750)/1000,O750*N750(1-X750)/1000)),IF(AND(E750=\"\",L750=\"\"),\"\",0))","v":""},"","","","","",null,null,0,{"$nulls":3},"No"]
[null,732,{"$nulls":5},"",null,"",{"$nulls":4},"",null,"",null,"No",null,"",{"v":0,"d":"0.0000"},"",{"v":0,"d":"0.00"},{"$f":"IF(R751=\"Interior\",IF(AND(L751=\"\",E751=\"\"),\"\",IF(OR(P751>0,O751=\"Enter Watts\",P751=\"\"),P751*N751*(1-X751)/1000,O751*N751(1-X751)/1000)),IF(AND(E751=\"\",L751=\"\"),\"\",0))","v":""},"","","","","",null,null,0,{"$nulls":3},"No"]
[null,733,{"$nulls":5},"",null,"",{"$nulls":4},"",null,"",null,"No",null,"",{"v":0,"d":"0.0000"},"",{"v":0,"d":"0.00"},{"$f":"IF(R752=\"Interior\",IF(AND(L752=\"\",E752=\"\"),\"\",IF(OR(P752>0,O752=\"Enter Watts\",P752=\"\"),P752*N752*(1-X752)/1000,O752*N752(1-X752)/1000)),IF(AND(E752=\"\",L752=\"\"),\"\",0))","v":""},"","","","","",null,null,0,{"$nulls":3},"No"]
[null,734,{"$nulls":5},"",null,"",{"$nulls":4},"",null,"",null,"No",null,"",{"v":0,"d":"0.0000"},"",{"v":0,"d":"0.00"},{"$f":"IF(R753=\"Interior\",IF(AND(L753=\"\",E753=\"\"),\"\",IF(OR(P753>0,O753=\"Enter Watts\",P753=\"\"),P753*N753*(1-X753)/1000,O753*N753(1-X753)/1000)),IF(AND(E753=\"\",L753=\"\"),\"\",0))","v":""},"","","","","",null,null,0,{"$nulls":3},"No"]
[null,735,{"$nulls":5},"",null,"",{"$nulls":4},"",null,"",null,"No",null,"",{"v":0,"d":"0.0000"},"",{"v":0,"d":"0.00"},{"$f":"IF(R754=\"Interior\",IF(AND(L754=\"\",E754=\"\"),\"\",IF(OR(P754>0,O754=\"Enter Watts\",P754=\"\"),P754*N754*(1-X754)/1000,O754*N754(1-X754)/1000)),IF(AND(E754=\"\",L754=\"\"),\"\",0))","v":""},"","","","","",null,null,0,{"$nulls":3},"No"]
[null,736,{"$nulls":5},"",null,"",{"$nulls":4},"",null,"",null,"No",null,"",{"v":0,"d":"0.0000"},"",{"v":0,"d":"0.00"},{"$f":"IF(R755=\"Interior\",IF(AND(L755=\"\",E755=\"\"),\"\",IF(OR(P755>0,O755=\"Enter Watts\",P755=\"\"),P755*N755*(1-X755)/1000,O755*N755(1-X755)/1000)),IF(AND(E755=\"\",L755=\"\"),\"\",0))","v":""},"","","","","",null,null,0,{"$nulls":3},"No"]
[null,737,{"$nulls":5},"",null,"",{"$nulls":4},"",null,"",null,"No",null,"",{"v":0,"d":"0.0000"},"",{"v":0,"d":"0.00"},{"$f":"IF(R756=\"Interior\",IF(AND(L756=\"\",E756=\"\"),\"\",IF(OR(P756>0,O756=\"Enter Watts\",P756=\"\"),P756*N756*(1-X756)/1000,O756*N756(1-X756)/1000)),IF(AND(E756=\"\",L756=\"\"),\"\",0))","v":""},"","","","","",null,null,0,{"$nulls":3},"No"]
[null,738,{"$nulls":5},"",null,"",{"$nulls":4},"",null,"",null,"No",null,"",{"v":0,"d":"0.0000"},"",{"v":0,"d":"0.00"},{"$f":"IF(R757=\"Interior\",IF(AND(L757=\"\",E757=\"\"),\"\",IF(OR(P757>0,O757=\"Enter Watts\",P757=\"\"),P757*N757*(1-X757)/1000,O757*N757(1-X757)/1000)),IF(AND(E757=\"\",L757=\"\"),\"\",0))","v":""},"","","","","",null,null,0,{"$nulls":3},"No"]
[null,739,{"$nulls":5},"",null,"",{"$nulls":4},"",null,"",null,"No",null,"",{"v":0,"d":"0.0000"},"",{"v":0,"d":"0.00"},{"$f":"IF(R758=\"Interior\",IF(AND(L758=\"\",E758=\"\"),\"\",IF(OR(P758>0,O758=\"Enter Watts\",P758=\"\"),P758*N758*(1-X758)/1000,O758*N758(1-X758)/1000)),IF(AND(E758=\"\",L758=\"\"),\"\",0))","v":""},"","","","","",null,null,0,{"$nulls":3},"No"]
[null,740,{"$nulls":5},"",null,"",{"$nulls":4},"",null,"",null,"No",null,"",{"v":0,"d":"0.0000"},"",{"v":0,"d":"0.00"},{"$f":"IF(R759=\"Interior\",IF(AND(L759=\"\",E759=\"\"),\"\",IF(OR(P759>0,O759=\"Enter Watts\",P759=\"\"),P759*N759*(1-X759)/1000,O759*N759(1-X759)/1000)),IF(AND(E759=\"\",L759=\"\"),\"\",0))","v":""},"","","","","",null,null,0,{"$nulls":3},"No"]
[null,741,{"$nulls":5},"",null,"",{"$nulls":4},"",null,"",null,"No",null,"",{"v":0,"d":"0.0000"},"",{"v":0,"d":"0.00"},{"$f":"IF(R760=\"Interior\",IF(AND(L760=\"\",E760=\"\"),\"\",IF(OR(P760>0,O760=\"Enter Watts\",P760=\"\"),P760*N760*(1-X760)/1000,O760*N760(1-X760)/1000)),IF(AND(E760=\"\",L760=\"\"),\"\",0))","v":""},"","","","","",null,null,0,{"$nulls":3},"No",{"$nulls":6},"","",null,""]
[null,742,{"$nulls":5},"",null,"",{"$nulls":4},"",null,"",null,"No",null,"",{"v":0,"d":"0.0000"},"",{"v":0,"d":"0.00"},{"$f":"IF(R761=\"Interior\",IF(AND(L761=\"\",E761=\"\"),\"\",IF(OR(P761>0,O761=\"Enter Watts\",P761=\"\"),P761*N761*(1-X761)/1000,O761*N761(1-X761)/1000)),IF(AND(E761=\"\",L761=\"\"),\"\",0))","v":""},"","","","","",null,null,0,{"$nulls":3},"No"]
[null,743,{"$nulls":5},"",null,"",{"$nulls":4},"",null,"",null,"No",null,"",{"v":0,"d":"0.0000"},"",{"v":0,"d":"0.00"},{"$f":"IF(R762=\"Interior\",IF(AND(L762=\"\",E762=\"\"),\"\",IF(OR(P762>0,O762=\"Enter Watts\",P762=\"\"),P762*N762*(1-X762)/1000,O762*N762(1-X762)/1000)),IF(AND(E762=\"\",L762=\"\"),\"\",0))","v":""},"","","","","",null,null,0,{"$nulls":3},"No"]
[null,744,{"$nulls":5},"",null,"",{"$nulls":4},"",null,"",null,"No",null,"",{"v":0,"d":"0.0000"},"",{"v":0,"d":"0.00"},{"$f":"IF(R763=\"Interior\",IF(AND(L763=\"\",E763=\"\"),\"\",IF(OR(P763>0,O763=\"Enter Watts\",P763=\"\"),P763*N763*(1-X763)/1000,O763*N763(1-X763)/1000)),IF(AND(E763=\"\",L763=\"\"),\"\",0))","v":""},"","","","","",null,null,0,{"$nulls":3},"No"]
[null,745,{"$nulls":5},"",null,"",{"$nulls":4},"",null,"",null,"No",null,"",{"v":0,"d":"0.0000"},"",{"v":0,"d":"0.00"},{"$f":"IF(R764=\"Interior\",IF(AND(L764=\"\",E764=\"\"),\"\",IF(OR(P764>0,O764=\"Enter Watts\",P764=\"\"),P764*N764*(1-X764)/1000,O764*N764(1-X764)/1000)),IF(AND(E764=\"\",L764=\"\"),\"\",0))","v":""},"","","","","",null,null,0,{"$nulls":3},"No"]
[null,746,{"$nulls":5},"",null,"",{"$nulls":4},"",null,"",null,"No",null,"",{"v":0,"d":"0.0000"},"",{"v":0,"d":"0.00"},{"$f":"IF(R765=\"Interior\",IF(AND(L765=\"\",E765=\"\"),\"\",IF(OR(P765>0,O765=\"Enter Watts\",P765=\"\"),P765*N765*(1-X765)/1000,O765*N765(1-X765)/1000)),IF(AND(E765=\"\",L765=\"\"),\"\",0))","v":""},"","","","","",null,null,0,{"$nulls":3},"No"]
[null,747,{"$nulls":5},"",null,"",{"$nulls":4},"",null,"",null,"No",null,"",{"v":0,"d":"0.0000"},"",{"v":0,"d":"0.00"},{"$f":"IF(R766=\"Interior\",IF(AND(L766=\"\",E766=\"\"),\"\",IF(OR(P766>0,O766=\"Enter Watts\",P766=\"\"),P766*N766*(1-X766)/1000,O766*N766(1-X766)/1000)),IF(AND(E766=\"\",L766=\"\"),\"\",0))","v":""},"","","","","",null,null,0,{"$nulls":3},"No",{"$nulls":6},"","",null,""]
[null,748,{"$nulls":5},"",null,"",{"$nulls":4},"",null,"",null,"No",null,"",{"v":0,"d":"0.0000"},"",{"v":0,"d":"0.00"},{"$f":"IF(R767=\"Interior\",IF(AND(L767=\"\",E767=\"\"),\"\",IF(OR(P767>0,O767=\"Enter Watts\",P767=\"\"),P767*N767*(1-X767)/1000,O767*N767(1-X767)/1000)),IF(AND(E767=\"\",L767=\"\"),\"\",0))","v":""},"","","","","",null,null,0,{"$nulls":3},"No"]
[null,749,{"$nulls":5},"",null,"",{"$nulls":4},"",null,"",null,"No",null,"",{"v":0,"d":"0.0000"},"",{"v":0,"d":"0.00"},{"$f":"IF(R768=\"Interior\",IF(AND(L768=\"\",E768=\"\"),\"\",IF(OR(P768>0,O768=\"Enter Watts\",P768=\"\"),P768*N768*(1-X768)/1000,O768*N768(1-X768)/1000)),IF(AND(E768=\"\",L768=\"\"),\"\",0))","v":""},"","","","","",null,null,0,{"$nulls":3},"No"]
[null,750,{"$nulls":5},{"$f":"IF(E769=\"\",\"\",VLOOKUP(E769,$AQ$1114:$AR$1541,2,FALSE))","v":""},null,"",{"$nulls":4},"",null,"",null,"No",null,"",{"v":0,"d":"0.0000"},"",{"v":0,"d":"0.00"},{"$f":"IF(R769=\"Interior\",IF(AND(L769=\"\",E769=\"\"),\"\",IF(OR(P769>0,O769=\"Enter Watts\",P769=\"\"),P769*N769*(1-X769)/1000,O769*N769(1-X769)/1000)),IF(AND(E769=\"\",L769=\"\"),\"\",0))","v":""},"","","","",{"$f":"IF(AC769=\"\",\"\",IF(AND(R769=\"Interior\",S769=\"No\",OR(T769=\"\",T769=\"No\")),$J$1027,IF(AND(R769=\"Interior\",S769=\"Yes\"),$J$1028,IF(AND(R769=\"Exterior\",S769=\"Yes\"),$J$1029,IF(AND(R769=\"Exterior\",S769=\"No\",N769<>G769),\"DNQ\",\"See Lighting Catalog to determine Code\")))))","v":""},null,null,0,{"$nulls":3},"No"]
[null,751,{"$nulls":5},"",null,"",{"$nulls":4},"",null,"",null,"No",null,"",{"v":0,"d":"0.0000"},"",{"v":0,"d":"0.00"},{"$f":"IF(R770=\"Interior\",IF(AND(L770=\"\",E770=\"\"),\"\",IF(OR(P770>0,O770=\"Enter Watts\",P770=\"\"),P770*N770*(1-X770)/1000,O770*N770(1-X770)/1000)),IF(AND(E770=\"\",L770=\"\"),\"\",0))","v":""},"","","","","",null,null,0,{"$nulls":3},"No"]
[null,752,{"$nulls":5},"",null,"",{"$nulls":4},"",null,"",null,"No",null,"",{"v":0,"d":"0.0000"},"",{"v":0,"d":"0.00"},{"$f":"IF(R771=\"Interior\",IF(AND(L771=\"\",E771=\"\"),\"\",IF(OR(P771>0,O771=\"Enter Watts\",P771=\"\"),P771*N771*(1-X771)/1000,O771*N771(1-X771)/1000)),IF(AND(E771=\"\",L771=\"\"),\"\",0))","v":""},"","","","","",null,null,0,{"$nulls":3},"No"]
[null,753,{"$nulls":5},"",null,"",{"$nulls":4},"",null,"",null,"No",null,"",{"v":0,"d":"0.0000"},"",{"v":0,"d":"0.00"},{"$f":"IF(R772=\"Interior\",IF(AND(L772=\"\",E772=\"\"),\"\",IF(OR(P772>0,O772=\"Enter Watts\",P772=\"\"),P772*N772*(1-X772)/1000,O772*N772(1-X772)/1000)),IF(AND(E772=\"\",L772=\"\"),\"\",0))","v":""},"","","","","",null,null,0,{"$nulls":3},"No"]
[null,754,{"$nulls":5},"",null,"",{"$nulls":4},"",null,"",null,"No",null,"",{"v":0,"d":"0.0000"},"",{"v":0,"d":"0.00"},{"$f":"IF(R773=\"Interior\",IF(AND(L773=\"\",E773=\"\"),\"\",IF(OR(P773>0,O773=\"Enter Watts\",P773=\"\"),P773*N773*(1-X773)/1000,O773*N773(1-X773)/1000)),IF(AND(E773=\"\",L773=\"\"),\"\",0))","v":""},"",{"$f":"IFERROR(IF(OR(I773>0,H773=\"Enter Watts\"),I773*G773,H773*G773)-IF(OR(P773>0,O773=\"Enter Watts\"),P773*N773,O773*N773),\"\")","v":""},"",{"$f":"IF(AND(W773=\"\",Z773=\"\"),\"\",IF(OR(W773=\"\",Z773=\"\"),0,W773-Z773))","v":""},"",null,null,0,{"$nulls":3},"No"]
[null,755,{"$nulls":5},"",null,"",{"$nulls":4},"",null,"",null,"No",null,"",{"v":0,"d":"0.0000"},"",{"v":0,"d":"0.00"},{"$f":"IF(R774=\"Interior\",IF(AND(L774=\"\",E774=\"\"),\"\",IF(OR(P774>0,O774=\"Enter Watts\",P774=\"\"),P774*N774*(1-X774)/1000,O774*N774(1-X774)/1000)),IF(AND(E774=\"\",L774=\"\"),\"\",0))","v":""},"",{"$f":"IFERROR(IF(OR(I774>0,H774=\"Enter Watts\"),I774*G774,H774*G774)-IF(OR(P774>0,O774=\"Enter Watts\"),P774*N774,O774*N774),\"\")","v":""},"",{"$f":"IF(AND(W774=\"\",Z774=\"\"),\"\",IF(OR(W774=\"\",Z774=\"\"),0,W774-Z774))","v":""},"",null,null,0,{"$nulls":3},"No"]
[null,756,{"$nulls":5},"",null,"",{"$nulls":4},"",null,"",null,"No",null,"",{"v":0,"d":"0.0000"},"",{"v":0,"d":"0.00"},{"$f":"IF(R775=\"Interior\",IF(AND(L775=\"\",E775=\"\"),\"\",IF(OR(P775>0,O775=\"Enter Watts\",P775=\"\"),P775*N775*(1-X775)/1000,O775*N775(1-X775)/1000)),IF(AND(E775=\"\",L775=\"\"),\"\",0))","v":""},"","","","","",null,null,0,{"$nulls":3},"No"]
[null,757,{"$nulls":5},"",null,"",{"$nulls":4},"",null,"",null,"No",null,"",{"v":0,"d":"0.0000"},"",{"v":0,"d":"0.00"},{"$f":"IF(R776=\"Interior\",IF(AND(L776=\"\",E776=\"\"),\"\",IF(OR(P776>0,O776=\"Enter Watts\",P776=\"\"),P776*N776*(1-X776)/1000,O776*N776(1-X776)/1000)),IF(AND(E776=\"\",L776=\"\"),\"\",0))","v":""},"","","","","",null,null,0,{"$nulls":3},"No"]
[null,758,{"$nulls":5},"",null,"",{"$nulls":4},"",null,"",null,"No",null,"",{"v":0,"d":"0.0000"},"",{"v":0,"d":"0.00"},{"$f":"IF(R777=\"Interior\",IF(AND(L777=\"\",E777=\"\"),\"\",IF(OR(P777>0,O777=\"Enter Watts\",P777=\"\"),P777*N777*(1-X777)/1000,O777*N777(1-X777)/1000)),IF(AND(E777=\"\",L777=\"\"),\"\",0))","v":""},"","","","","",null,null,0,{"$nulls":3},"No",{"$nulls":6},"","",null,""]
[null,759,{"$nulls":5},"",null,"",{"$nulls":4},"",null,"",null,"No",null,"",{"v":0,"d":"0.0000"},"",{"v":0,"d":"0.00"},{"$f":"IF(R778=\"Interior\",IF(AND(L778=\"\",E778=\"\"),\"\",IF(OR(P778>0,O778=\"Enter Watts\",P778=\"\"),P778*N778*(1-X778)/1000,O778*N778(1-X778)/1000)),IF(AND(E778=\"\",L778=\"\"),\"\",0))","v":""},"","","","","",null,null,0,{"$nulls":3},"No"]
[null,760,{"$nulls":5},"",null,"",{"$nulls":4},"",null,"",null,"No",null,"",{"v":0,"d":"0.0000"},"",{"v":0,"d":"0.00"},{"$f":"IF(R779=\"Interior\",IF(AND(L779=\"\",E779=\"\"),\"\",IF(OR(P779>0,O779=\"Enter Watts\",P779=\"\"),P779*N779*(1-X779)/1000,O779*N779(1-X779)/1000)),IF(AND(E779=\"\",L779=\"\"),\"\",0))","v":""},"","","","","",null,null,0,{"$nulls":3},"No"]
[null,761,{"$nulls":5},"",null,"",{"$nulls":4},"",null,"",null,"No",null,"",{"v":0,"d":"0.0000"},"",{"v":0,"d":"0.00"},{"$f":"IF(R780=\"Interior\",IF(AND(L780=\"\",E780=\"\"),\"\",IF(OR(P780>0,O780=\"Enter Watts\",P780=\"\"),P780*N780*(1-X780)/1000,O780*N780(1-X780)/1000)),IF(AND(E780=\"\",L780=\"\"),\"\",0))","v":""},"","","","","",null,null,0,{"$nulls":3},"No"]
[null,762,{"$nulls":5},"",null,"",{"$nulls":4},"",null,"",null,"No",null,"",{"v":0,"d":"0.0000"},"",{"v":0,"d":"0.00"},{"$f":"IF(R781=\"Interior\",IF(AND(L781=\"\",E781=\"\"),\"\",IF(OR(P781>0,O781=\"Enter Watts\",P781=\"\"),P781*N781*(1-X781)/1000,O781*N781(1-X781)/1000)),IF(AND(E781=\"\",L781=\"\"),\"\",0))","v":""},"","","","","",null,null,0,{"$nulls":3},"No"]
[null,763,{"$nulls":5},"",null,"",{"$nulls":4},"",null,"",null,"No",null,"",{"v":0,"d":"0.0000"},"",{"v":0,"d":"0.00"},{"$f":"IF(R782=\"Interior\",IF(AND(L782=\"\",E782=\"\"),\"\",IF(OR(P782>0,O782=\"Enter Watts\",P782=\"\"),P782*N782*(1-X782)/1000,O782*N782(1-X782)/1000)),IF(AND(E782=\"\",L782=\"\"),\"\",0))","v":""},"","","","","",null,null,0,{"$nulls":3},"No"]
[null,764,{"$nulls":5},"",null,"",{"$nulls":4},"",null,"",null,"No",null,"",{"v":0,"d":"0.0000"},"",{"v":0,"d":"0.00"},{"$f":"IF(R783=\"Interior\",IF(AND(L783=\"\",E783=\"\"),\"\",IF(OR(P783>0,O783=\"Enter Watts\",P783=\"\"),P783*N783*(1-X783)/1000,O783*N783(1-X783)/1000)),IF(AND(E783=\"\",L783=\"\"),\"\",0))","v":""},"","","","","",null,null,0,{"$nulls":3},"No",{"$nulls":6},"","",null,""]
[null,765,{"$nulls":5},"",null,"",{"$nulls":4},"",null,"",null,"No",null,"",{"v":0,"d":"0.0000"},"",{"v":0,"d":"0.00"},{"$f":"IF(R784=\"Interior\",IF(AND(L784=\"\",E784=\"\"),\"\",IF(OR(P784>0,O784=\"Enter Watts\",P784=\"\"),P784*N784*(1-X784)/1000,O784*N784(1-X784)/1000)),IF(AND(E784=\"\",L784=\"\"),\"\",0))","v":""},"","","","","",null,null,0,{"$nulls":3},"No"]
[null,766,{"$nulls":5},"",null,"",{"$nulls":4},"",null,"",null,"No",null,"",{"v":0,"d":"0.0000"},"",{"v":0,"d":"0.00"},{"$f":"IF(R785=\"Interior\",IF(AND(L785=\"\",E785=\"\"),\"\",IF(OR(P785>0,O785=\"Enter Watts\",P785=\"\"),P785*N785*(1-X785)/1000,O785*N785(1-X785)/1000)),IF(AND(E785=\"\",L785=\"\"),\"\",0))","v":""},"","","","","",null,null,0,{"$nulls":3},"No"]
[null,767,{"$nulls":5},"",null,"",{"$nulls":4},"",null,"",null,"No",null,"",{"v":0,"d":"0.0000"},"",{"v":0,"d":"0.00"},{"$f":"IF(R786=\"Interior\",IF(AND(L786=\"\",E786=\"\"),\"\",IF(OR(P786>0,O786=\"Enter Watts\",P786=\"\"),P786*N786*(1-X786)/1000,O786*N786(1-X786)/1000)),IF(AND(E786=\"\",L786=\"\"),\"\",0))","v":""},"","","","","",null,null,0,{"$nulls":3},"No"]
[null,768,{"$nulls":5},"",null,"",{"$nulls":4},"",null,"",null,"No",null,"",{"v":0,"d":"0.0000"},"",{"v":0,"d":"0.00"},{"$f":"IF(R787=\"Interior\",IF(AND(L787=\"\",E787=\"\"),\"\",IF(OR(P787>0,O787=\"Enter Watts\",P787=\"\"),P787*N787*(1-X787)/1000,O787*N787(1-X787)/1000)),IF(AND(E787=\"\",L787=\"\"),\"\",0))","v":""},"","","","","",null,null,0,{"$nulls":3},"No"]
[null,769,{"$nulls":5},"",null,{"$f":"IF(AND(E788<>\"\",G788<>\"\",$E$8=\"Default Sector Hours\"),VLOOKUP(IF(R788=\"Exterior\",\"Exterior\",$E$7),$W$1036:$X$1041,2,FALSE),\"\")","v":""},{"$nulls":4},{"$f":"IF(L788=\"\",\"\",VLOOKUP(L788,$AQ$1113:$AR$1541,2,FALSE))","v":""},null,"",null,"No",null,"",{"v":0,"d":"0.0000"},"",{"v":0,"d":"0.00"},{"$f":"IF(R788=\"Interior\",IF(AND(L788=\"\",E788=\"\"),\"\",IF(OR(P788>0,O788=\"Enter Watts\",P788=\"\"),P788*N788*(1-X788)/1000,O788*N788(1-X788)/1000)),IF(AND(E788=\"\",L788=\"\"),\"\",0))","v":""},{"$f":"IFERROR(IF(AND(L788=\"\", E788=\"\"),\"\",N788/1000*IF(OR(P788>0,O788=\"Enter Watts\"),P788,O788)*IF(R788=\"Exterior\",$X$1041,IF($E$8=\"Manual Input\",Q788,VLOOKUP($E$7,$W$1036:$Z$1040,2,FALSE)))*IF(S788=\"Yes\",IF(R788=\"Exterior\",1-$Z$1041,1-VLOOKUP($E$7,$W$1036:$Z$1040,4,FALSE)),1)),0)","v":""},"",{"$f":"IF(AND(U788=\"\",Y788=\"\"),\"\",IF(OR(U788=\"\",Y788=\"\"),0,  IF($E$8=\"Manual Input\",$G$9,   VLOOKUP($E$7,$W$1036:$Z$1041,3,FALSE))     *(U788-Y788)))","v":""},"","",null,null,0,{"$nulls":3},"No"]
[null,770,{"$nulls":5},"",null,"",{"$nulls":4},"",null,"",null,"No",null,{"$f":"IF(V789=\"Int Control\",IF(E789=\"\",\"\",IF(OR(I789>0,H789=\"Enter Watts\"),I789*G789/1000*(1-$E$15),H789*G789/1000*(1-$E$15))),IF(E789=\"\",\"\",IF(OR(I789>0,H789=\"Enter Watts\"),I789*G789/1000,H789*G789/1000)))","v":""},{"$f":"IF(AND(R789=\"Interior\",S789=\"Yes\"),\"Int Control\",0)","v":{"v":0,"d":"0.0000"}},{"$f":"IFERROR(IF(V789=\"Int Control\",IF(E789=\"\",\"\",G789/1000*(1-$E$15)*IF(OR(I789>0,H789=\"Enter Watts\"),I789,H789)*IF(R789=\"Exterior\",$X$1041*(1-$G$15),IF($E$8=\"Manual Input\",J789,VLOOKUP($E$7,$W$1036:$Z$1040,2,FALSE)*(1-$E$15)))),IF(E789=\"\",\"\",G789/1000*IF(OR(I789>0,H789=\"Enter Watts\"),I789,H789)*IF(R789=\"Exterior\",$X$1041,IF($E$8=\"Manual Input\",J789,VLOOKUP($E$7,$W$1036:$Z$1040,2,FALSE))))),\"0\")","v":""},{"$f":"IF(S789=\"No\",0,AA$1036)","v":{"v":0,"d":"0.00"}},{"$f":"IF(R789=\"Interior\",IF(AND(L789=\"\",E789=\"\"),\"\",IF(OR(P789>0,O789=\"Enter Watts\",P789=\"\"),P789*N789*(1-X789)/1000,O789*N789(1-X789)/1000)),IF(AND(E789=\"\",L789=\"\"),\"\",0))","v":""},"","","","","",null,null,{"$f":"AF789*N789","v":0},{"$nulls":3},{"$f":"IF(_xlfn.ISFORMULA(J789)=TRUE,\"No\",\"Yes\")","v":"No"}]
[null,771,{"$nulls":5},"",null,"",{"$nulls":4},"",null,"",null,"No",null,"",{"v":0,"d":"0.0000"},"",{"v":0,"d":"0.00"},{"$f":"IF(R790=\"Interior\",IF(AND(L790=\"\",E790=\"\"),\"\",IF(OR(P790>0,O790=\"Enter Watts\",P790=\"\"),P790*N790*(1-X790)/1000,O790*N790(1-X790)/1000)),IF(AND(E790=\"\",L790=\"\"),\"\",0))","v":""},"","","","","",null,null,0,{"$nulls":3},"No",{"$nulls":6},"","",null,""]
[null,772,{"$nulls":5},"",null,"",{"$nulls":4},"",null,"",null,"No",null,"",{"v":0,"d":"0.0000"},"",{"v":0,"d":"0.00"},{"$f":"IF(R791=\"Interior\",IF(AND(L791=\"\",E791=\"\"),\"\",IF(OR(P791>0,O791=\"Enter Watts\",P791=\"\"),P791*N791*(1-X791)/1000,O791*N791(1-X791)/1000)),IF(AND(E791=\"\",L791=\"\"),\"\",0))","v":""},"","","","","",null,null,0,{"$nulls":3},"No"]
[null,773,{"$nulls":5},"",null,"",{"$nulls":4},"",null,"",null,"No",null,"",{"v":0,"d":"0.0000"},"",{"v":0,"d":"0.00"},{"$f":"IF(R792=\"Interior\",IF(AND(L792=\"\",E792=\"\"),\"\",IF(OR(P792>0,O792=\"Enter Watts\",P792=\"\"),P792*N792*(1-X792)/1000,O792*N792(1-X792)/1000)),IF(AND(E792=\"\",L792=\"\"),\"\",0))","v":""},"","","","","",null,null,0,{"$nulls":3},"No"]
[null,774,{"$nulls":5},"",null,"",{"$nulls":4},"",null,"",null,"No",null,"",{"v":0,"d":"0.0000"},"",{"v":0,"d":"0.00"},{"$f":"IF(R793=\"Interior\",IF(AND(L793=\"\",E793=\"\"),\"\",IF(OR(P793>0,O793=\"Enter Watts\",P793=\"\"),P793*N793*(1-X793)/1000,O793*N793(1-X793)/1000)),IF(AND(E793=\"\",L793=\"\"),\"\",0))","v":""},"","","","","",null,null,0,{"$nulls":3},"No"]
[null,775,{"$nulls":5},"",null,"",{"$nulls":4},"",null,"",null,"No",null,"",{"v":0,"d":"0.0000"},"",{"v":0,"d":"0.00"},{"$f":"IF(R794=\"Interior\",IF(AND(L794=\"\",E794=\"\"),\"\",IF(OR(P794>0,O794=\"Enter Watts\",P794=\"\"),P794*N794*(1-X794)/1000,O794*N794(1-X794)/1000)),IF(AND(E794=\"\",L794=\"\"),\"\",0))","v":""},"","","","","",null,null,0,{"$nulls":3},"No"]
[null,776,{"$nulls":5},"",null,"",{"$nulls":4},"",null,"",null,"No",null,"",{"v":0,"d":"0.0000"},"",{"v":0,"d":"0.00"},{"$f":"IF(R795=\"Interior\",IF(AND(L795=\"\",E795=\"\"),\"\",IF(OR(P795>0,O795=\"Enter Watts\",P795=\"\"),P795*N795*(1-X795)/1000,O795*N795(1-X795)/1000)),IF(AND(E795=\"\",L795=\"\"),\"\",0))","v":""},"","","","","",null,null,0,{"$nulls":3},"No"]
[null,777,{"$nulls":5},"",null,"",{"$nulls":4},"",null,"",null,"No",null,"",{"v":0,"d":"0.0000"},"",{"v":0,"d":"0.00"},{"$f":"IF(R796=\"Interior\",IF(AND(L796=\"\",E796=\"\"),\"\",IF(OR(P796>0,O796=\"Enter Watts\",P796=\"\"),P796*N796*(1-X796)/1000,O796*N796(1-X796)/1000)),IF(AND(E796=\"\",L796=\"\"),\"\",0))","v":""},"","","","","",null,null,0,{"$nulls":3},"No",{"$nulls":6},"","",null,""]
[null,778,{"$nulls":5},"",null,"",{"$nulls":4},"",null,"",null,"No",null,"",{"v":0,"d":"0.0000"},"",{"v":0,"d":"0.00"},{"$f":"IF(R797=\"Interior\",IF(AND(L797=\"\",E797=\"\"),\"\",IF(OR(P797>0,O797=\"Enter Watts\",P797=\"\"),P797*N797*(1-X797)/1000,O797*N797(1-X797)/1000)),IF(AND(E797=\"\",L797=\"\"),\"\",0))","v":""},"","","","","",null,null,0,{"$nulls":3},"No"]
[null,779,{"$nulls":5},"",null,"",{"$nulls":4},"",null,"",null,"No",null,"",{"v":0,"d":"0.0000"},"",{"v":0,"d":"0.00"},{"$f":"IF(R798=\"Interior\",IF(AND(L798=\"\",E798=\"\"),\"\",IF(OR(P798>0,O798=\"Enter Watts\",P798=\"\"),P798*N798*(1-X798)/1000,O798*N798(1-X798)/1000)),IF(AND(E798=\"\",L798=\"\"),\"\",0))","v":""},"","","","","",null,null,0,{"$nulls":3},"No"]
[null,780,{"$nulls":5},"",null,"",{"$nulls":4},"",null,"",null,"No",null,"",{"v":0,"d":"0.0000"},"",{"v":0,"d":"0.00"},{"$f":"IF(R799=\"Interior\",IF(AND(L799=\"\",E799=\"\"),\"\",IF(OR(P799>0,O799=\"Enter Watts\",P799=\"\"),P799*N799*(1-X799)/1000,O799*N799(1-X799)/1000)),IF(AND(E799=\"\",L799=\"\"),\"\",0))","v":""},"","","","","",null,null,0,{"$nulls":3},"No"]
[null,781,{"$nulls":5},"",null,"",{"$nulls":4},"",null,"",null,"No",null,"",{"v":0,"d":"0.0000"},"",{"v":0,"d":"0.00"},{"$f":"IF(R800=\"Interior\",IF(AND(L800=\"\",E800=\"\"),\"\",IF(OR(P800>0,O800=\"Enter Watts\",P800=\"\"),P800*N800*(1-X800)/1000,O800*N800(1-X800)/1000)),IF(AND(E800=\"\",L800=\"\"),\"\",0))","v":""},"","","","","",null,null,0,{"$nulls":3},"No"]
[null,782,{"$nulls":5},"",null,"",{"$nulls":4},"",null,"",null,"No",null,"",{"v":0,"d":"0.0000"},"",{"v":0,"d":"0.00"},{"$f":"IF(R801=\"Interior\",IF(AND(L801=\"\",E801=\"\"),\"\",IF(OR(P801>0,O801=\"Enter Watts\",P801=\"\"),P801*N801*(1-X801)/1000,O801*N801(1-X801)/1000)),IF(AND(E801=\"\",L801=\"\"),\"\",0))","v":""},"","","","","",null,null,0,{"$nulls":3},"No"]
[null,783,{"$nulls":5},"",null,"",{"$nulls":4},"",null,"",null,"No",null,"",{"v":0,"d":"0.0000"},"",{"v":0,"d":"0.00"},{"$f":"IF(R802=\"Interior\",IF(AND(L802=\"\",E802=\"\"),\"\",IF(OR(P802>0,O802=\"Enter Watts\",P802=\"\"),P802*N802*(1-X802)/1000,O802*N802(1-X802)/1000)),IF(AND(E802=\"\",L802=\"\"),\"\",0))","v":""},"","","","","",null,null,0,{"$nulls":3},"No"]
[null,784,{"$nulls":5},"",null,"",{"$nulls":4},"",null,"",null,"No",null,"",{"v":0,"d":"0.0000"},"",{"v":0,"d":"0.00"},{"$f":"IF(R803=\"Interior\",IF(AND(L803=\"\",E803=\"\"),\"\",IF(OR(P803>0,O803=\"Enter Watts\",P803=\"\"),P803*N803*(1-X803)/1000,O803*N803(1-X803)/1000)),IF(AND(E803=\"\",L803=\"\"),\"\",0))","v":""},"","","","","",null,null,0,{"$nulls":3},"No"]
[null,785,{"$nulls":5},"",null,"",{"$nulls":4},"",null,"",null,"No",null,"",{"v":0,"d":"0.0000"},"",{"v":0,"d":"0.00"},{"$f":"IF(R804=\"Interior\",IF(AND(L804=\"\",E804=\"\"),\"\",IF(OR(P804>0,O804=\"Enter Watts\",P804=\"\"),P804*N804*(1-X804)/1000,O804*N804(1-X804)/1000)),IF(AND(E804=\"\",L804=\"\"),\"\",0))","v":""},"","","","","",null,null,0,{"$nulls":3},"No"]
[null,786,{"$nulls":5},"",null,"",{"$nulls":4},"",null,"",null,"No",null,"",{"v":0,"d":"0.0000"},"",{"v":0,"d":"0.00"},{"$f":"IF(R805=\"Interior\",IF(AND(L805=\"\",E805=\"\"),\"\",IF(OR(P805>0,O805=\"Enter Watts\",P805=\"\"),P805*N805*(1-X805)/1000,O805*N805(1-X805)/1000)),IF(AND(E805=\"\",L805=\"\"),\"\",0))","v":""},"","","","","",null,null,0,{"$nulls":3},"No"]
[null,787,{"$nulls":5},"",null,"",{"$nulls":4},"",null,"",null,"No",null,"",{"v":0,"d":"0.0000"},"",{"v":0,"d":"0.00"},{"$f":"IF(R806=\"Interior\",IF(AND(L806=\"\",E806=\"\"),\"\",IF(OR(P806>0,O806=\"Enter Watts\",P806=\"\"),P806*N806*(1-X806)/1000,O806*N806(1-X806)/1000)),IF(AND(E806=\"\",L806=\"\"),\"\",0))","v":""},"","","","","",null,null,0,{"$nulls":3},"No"]
[null,788,{"$nulls":5},"",null,"",{"$nulls":4},"",null,"",null,"No",null,"",{"v":0,"d":"0.0000"},"",{"v":0,"d":"0.00"},{"$f":"IF(R807=\"Interior\",IF(AND(L807=\"\",E807=\"\"),\"\",IF(OR(P807>0,O807=\"Enter Watts\",P807=\"\"),P807*N807*(1-X807)/1000,O807*N807(1-X807)/1000)),IF(AND(E807=\"\",L807=\"\"),\"\",0))","v":""},"","","","","",null,null,0,{"$nulls":3},"No"]
[null,789,{"$nulls":5},"",null,"",{"$nulls":4},"",null,"",null,"No",null,"",{"v":0,"d":"0.0000"},"",{"v":0,"d":"0.00"},{"$f":"IF(R808=\"Interior\",IF(AND(L808=\"\",E808=\"\"),\"\",IF(OR(P808>0,O808=\"Enter Watts\",P808=\"\"),P808*N808*(1-X808)/1000,O808*N808(1-X808)/1000)),IF(AND(E808=\"\",L808=\"\"),\"\",0))","v":""},"","","","","",null,null,0,{"$nulls":3},"No",{"$nulls":6},"","",null,""]
[null,790,{"$nulls":5},"",null,"",{"$nulls":4},"",null,"",null,"No",null,"",{"v":0,"d":"0.0000"},"",{"v":0,"d":"0.00"},{"$f":"IF(R809=\"Interior\",IF(AND(L809=\"\",E809=\"\"),\"\",IF(OR(P809>0,O809=\"Enter Watts\",P809=\"\"),P809*N809*(1-X809)/1000,O809*N809(1-X809)/1000)),IF(AND(E809=\"\",L809=\"\"),\"\",0))","v":""},"","","","","",null,null,0,{"$nulls":3},"No"]
[null,791,{"$nulls":5},"",null,"",{"$nulls":4},"",null,"",null,"No",null,"",{"v":0,"d":"0.0000"},"",{"v":0,"d":"0.00"},{"$f":"IF(R810=\"Interior\",IF(AND(L810=\"\",E810=\"\"),\"\",IF(OR(P810>0,O810=\"Enter Watts\",P810=\"\"),P810*N810*(1-X810)/1000,O810*N810(1-X810)/1000)),IF(AND(E810=\"\",L810=\"\"),\"\",0))","v":""},"","","","","",null,null,0,{"$nulls":3},"No"]
[null,792,{"$nulls":5},"",null,"",{"$nulls":4},"",null,"",null,"No",null,"",{"v":0,"d":"0.0000"},"",{"v":0,"d":"0.00"},{"$f":"IF(R811=\"Interior\",IF(AND(L811=\"\",E811=\"\"),\"\",IF(OR(P811>0,O811=\"Enter Watts\",P811=\"\"),P811*N811*(1-X811)/1000,O811*N811(1-X811)/1000)),IF(AND(E811=\"\",L811=\"\"),\"\",0))","v":""},"","","","","",null,null,0,{"$nulls":3},"No"]
[null,793,{"$nulls":5},"",null,"",{"$nulls":4},"",null,"",null,"No",null,"",{"v":0,"d":"0.0000"},"",{"v":0,"d":"0.00"},{"$f":"IF(R812=\"Interior\",IF(AND(L812=\"\",E812=\"\"),\"\",IF(OR(P812>0,O812=\"Enter Watts\",P812=\"\"),P812*N812*(1-X812)/1000,O812*N812(1-X812)/1000)),IF(AND(E812=\"\",L812=\"\"),\"\",0))","v":""},"","","","","",null,null,0,{"$nulls":3},"No"]
[null,794,{"$nulls":5},"",null,"",{"$nulls":4},"",null,"",null,"No",null,"",{"v":0,"d":"0.0000"},"",{"v":0,"d":"0.00"},{"$f":"IF(R813=\"Interior\",IF(AND(L813=\"\",E813=\"\"),\"\",IF(OR(P813>0,O813=\"Enter Watts\",P813=\"\"),P813*N813*(1-X813)/1000,O813*N813(1-X813)/1000)),IF(AND(E813=\"\",L813=\"\"),\"\",0))","v":""},"","","","","",null,null,0,{"$nulls":3},"No"]
[null,795,{"$nulls":5},"",null,"",{"$nulls":4},"",null,"",null,"No",null,"",{"v":0,"d":"0.0000"},"",{"v":0,"d":"0.00"},{"$f":"IF(R814=\"Interior\",IF(AND(L814=\"\",E814=\"\"),\"\",IF(OR(P814>0,O814=\"Enter Watts\",P814=\"\"),P814*N814*(1-X814)/1000,O814*N814(1-X814)/1000)),IF(AND(E814=\"\",L814=\"\"),\"\",0))","v":""},"","","","","",null,null,0,{"$nulls":3},"No",{"$nulls":6},"","",null,""]
[null,796,{"$nulls":5},"",null,"",{"$nulls":4},"",null,"",null,"No",null,"",{"v":0,"d":"0.0000"},"",{"v":0,"d":"0.00"},{"$f":"IF(R815=\"Interior\",IF(AND(L815=\"\",E815=\"\"),\"\",IF(OR(P815>0,O815=\"Enter Watts\",P815=\"\"),P815*N815*(1-X815)/1000,O815*N815(1-X815)/1000)),IF(AND(E815=\"\",L815=\"\"),\"\",0))","v":""},"","","","","",null,null,0,{"$nulls":3},"No"]
[null,797,{"$nulls":5},"",null,"",{"$nulls":4},"",null,"",null,"No",null,"",{"v":0,"d":"0.0000"},"",{"v":0,"d":"0.00"},{"$f":"IF(R816=\"Interior\",IF(AND(L816=\"\",E816=\"\"),\"\",IF(OR(P816>0,O816=\"Enter Watts\",P816=\"\"),P816*N816*(1-X816)/1000,O816*N816(1-X816)/1000)),IF(AND(E816=\"\",L816=\"\"),\"\",0))","v":""},"","","","","",null,null,0,{"$nulls":3},"No"]
[null,798,{"$nulls":5},"",null,"",{"$nulls":4},"",null,"",null,"No",null,"",{"v":0,"d":"0.0000"},"",{"v":0,"d":"0.00"},{"$f":"IF(R817=\"Interior\",IF(AND(L817=\"\",E817=\"\"),\"\",IF(OR(P817>0,O817=\"Enter Watts\",P817=\"\"),P817*N817*(1-X817)/1000,O817*N817(1-X817)/1000)),IF(AND(E817=\"\",L817=\"\"),\"\",0))","v":""},"","","","","",null,null,0,{"$nulls":3},"No"]
[null,799,{"$nulls":5},"",null,"",{"$nulls":4},"",null,"",null,"No",null,"",{"v":0,"d":"0.0000"},"",{"v":0,"d":"0.00"},{"$f":"IF(R818=\"Interior\",IF(AND(L818=\"\",E818=\"\"),\"\",IF(OR(P818>0,O818=\"Enter Watts\",P818=\"\"),P818*N818*(1-X818)/1000,O818*N818(1-X818)/1000)),IF(AND(E818=\"\",L818=\"\"),\"\",0))","v":""},"","","","","",null,null,0,{"$nulls":3},"No"]
[null,800,{"$nulls":5},"",null,"",{"$nulls":4},"",null,"",null,"No",null,"",{"v":0,"d":"0.0000"},"",{"v":0,"d":"0.00"},{"$f":"IF(R819=\"Interior\",IF(AND(L819=\"\",E819=\"\"),\"\",IF(OR(P819>0,O819=\"Enter Watts\",P819=\"\"),P819*N819*(1-X819)/1000,O819*N819(1-X819)/1000)),IF(AND(E819=\"\",L819=\"\"),\"\",0))","v":""},"","","","","",null,null,0,{"$nulls":3},"No"]
[null,801,{"$nulls":5},"",null,"",{"$nulls":4},"",null,"",null,"No",null,"",{"v":0,"d":"0.0000"},"",{"v":0,"d":"0.00"},{"$f":"IF(R820=\"Interior\",IF(AND(L820=\"\",E820=\"\"),\"\",IF(OR(P820>0,O820=\"Enter Watts\",P820=\"\"),P820*N820*(1-X820)/1000,O820*N820(1-X820)/1000)),IF(AND(E820=\"\",L820=\"\"),\"\",0))","v":""},"","","","","",null,null,0,{"$nulls":3},"No"]
[null,802,{"$nulls":5},"",null,"",{"$nulls":4},"",null,"",null,"No",null,"",{"v":0,"d":"0.0000"},"",{"v":0,"d":"0.00"},{"$f":"IF(R821=\"Interior\",IF(AND(L821=\"\",E821=\"\"),\"\",IF(OR(P821>0,O821=\"Enter Watts\",P821=\"\"),P821*N821*(1-X821)/1000,O821*N821(1-X821)/1000)),IF(AND(E821=\"\",L821=\"\"),\"\",0))","v":""},"",{"$f":"IFERROR(IF(OR(I821>0,H821=\"Enter Watts\"),I821*G821,H821*G821)-IF(OR(P821>0,O821=\"Enter Watts\"),P821*N821,O821*N821),\"\")","v":""},"",{"$f":"IF(AND(W821=\"\",Z821=\"\"),\"\",IF(OR(W821=\"\",Z821=\"\"),0,W821-Z821))","v":""},"",null,null,0,{"$nulls":3},"No"]
[null,803,{"$nulls":5},"",null,"",{"$nulls":4},"",null,"",null,"No",null,"",{"v":0,"d":"0.0000"},"",{"v":0,"d":"0.00"},{"$f":"IF(R822=\"Interior\",IF(AND(L822=\"\",E822=\"\"),\"\",IF(OR(P822>0,O822=\"Enter Watts\",P822=\"\"),P822*N822*(1-X822)/1000,O822*N822(1-X822)/1000)),IF(AND(E822=\"\",L822=\"\"),\"\",0))","v":""},"",{"$f":"IFERROR(IF(OR(I822>0,H822=\"Enter Watts\"),I822*G822,H822*G822)-IF(OR(P822>0,O822=\"Enter Watts\"),P822*N822,O822*N822),\"\")","v":""},"",{"$f":"IF(AND(W822=\"\",Z822=\"\"),\"\",IF(OR(W822=\"\",Z822=\"\"),0,W822-Z822))","v":""},"",null,null,0,{"$nulls":3},"No"]
[null,804,{"$nulls":5},"",null,"",{"$nulls":4},"",null,"",null,"No",null,"",{"v":0,"d":"0.0000"},"",{"v":0,"d":"0.00"},{"$f":"IF(R823=\"Interior\",IF(AND(L823=\"\",E823=\"\"),\"\",IF(OR(P823>0,O823=\"Enter Watts\",P823=\"\"),P823*N823*(1-X823)/1000,O823*N823(1-X823)/1000)),IF(AND(E823=\"\",L823=\"\"),\"\",0))","v":""},"","","","","",null,null,0,{"$nulls":3},"No"]
[null,805,{"$nulls":5},"",null,"",{"$nulls":4},"",null,"",null,"No",null,"",{"v":0,"d":"0.0000"},"",{"v":0,"d":"0.00"},{"$f":"IF(R824=\"Interior\",IF(AND(L824=\"\",E824=\"\"),\"\",IF(OR(P824>0,O824=\"Enter Watts\",P824=\"\"),P824*N824*(1-X824)/1000,O824*N824(1-X824)/1000)),IF(AND(E824=\"\",L824=\"\"),\"\",0))","v":""},"","","","","",null,null,0,{"$nulls":3},"No"]
[null,806,{"$nulls":5},"",null,"",{"$nulls":4},"",null,"",null,"No",null,"",{"v":0,"d":"0.0000"},"",{"v":0,"d":"0.00"},{"$f":"IF(R825=\"Interior\",IF(AND(L825=\"\",E825=\"\"),\"\",IF(OR(P825>0,O825=\"Enter Watts\",P825=\"\"),P825*N825*(1-X825)/1000,O825*N825(1-X825)/1000)),IF(AND(E825=\"\",L825=\"\"),\"\",0))","v":""},"","","","","",null,null,0,{"$nulls":3},"No",{"$nulls":6},"","",null,""]
[null,807,{"$nulls":5},"",null,"",{"$nulls":4},"",null,"",null,"No",null,"",{"v":0,"d":"0.0000"},"",{"v":0,"d":"0.00"},{"$f":"IF(R826=\"Interior\",IF(AND(L826=\"\",E826=\"\"),\"\",IF(OR(P826>0,O826=\"Enter Watts\",P826=\"\"),P826*N826*(1-X826)/1000,O826*N826(1-X826)/1000)),IF(AND(E826=\"\",L826=\"\"),\"\",0))","v":""},"","","","","",null,null,0,{"$nulls":3},"No"]
[null,808,{"$nulls":5},"",null,"",{"$nulls":4},"",null,"",null,"No",null,"",{"v":0,"d":"0.0000"},"",{"v":0,"d":"0.00"},{"$f":"IF(R827=\"Interior\",IF(AND(L827=\"\",E827=\"\"),\"\",IF(OR(P827>0,O827=\"Enter Watts\",P827=\"\"),P827*N827*(1-X827)/1000,O827*N827(1-X827)/1000)),IF(AND(E827=\"\",L827=\"\"),\"\",0))","v":""},"","","","","",null,null,0,{"$nulls":3},"No"]
[null,809,{"$nulls":5},"",null,"",{"$nulls":4},"",null,"",null,"No",null,"",{"v":0,"d":"0.0000"},"",{"v":0,"d":"0.00"},{"$f":"IF(R828=\"Interior\",IF(AND(L828=\"\",E828=\"\"),\"\",IF(OR(P828>0,O828=\"Enter Watts\",P828=\"\"),P828*N828*(1-X828)/1000,O828*N828(1-X828)/1000)),IF(AND(E828=\"\",L828=\"\"),\"\",0))","v":""},"","","","","",null,null,0,{"$nulls":3},"No"]
[null,810,{"$nulls":5},"",null,"",{"$nulls":4},"",null,"",null,"No",null,"",{"v":0,"d":"0.0000"},"",{"v":0,"d":"0.00"},{"$f":"IF(R829=\"Interior\",IF(AND(L829=\"\",E829=\"\"),\"\",IF(OR(P829>0,O829=\"Enter Watts\",P829=\"\"),P829*N829*(1-X829)/1000,O829*N829(1-X829)/1000)),IF(AND(E829=\"\",L829=\"\"),\"\",0))","v":""},"","","","","",null,null,0,{"$nulls":3},"No"]
[null,811,{"$nulls":5},"",null,"",{"$nulls":4},"",null,"",null,"No",null,"",{"v":0,"d":"0.0000"},"",{"v":0,"d":"0.00"},{"$f":"IF(R830=\"Interior\",IF(AND(L830=\"\",E830=\"\"),\"\",IF(OR(P830>0,O830=\"Enter Watts\",P830=\"\"),P830*N830*(1-X830)/1000,O830*N830(1-X830)/1000)),IF(AND(E830=\"\",L830=\"\"),\"\",0))","v":""},"","","","","",null,null,0,{"$nulls":3},"No"]
[null,812,{"$nulls":5},"",null,"",{"$nulls":4},"",null,"",null,"No",null,"",{"v":0,"d":"0.0000"},"",{"v":0,"d":"0.00"},{"$f":"IF(R831=\"Interior\",IF(AND(L831=\"\",E831=\"\"),\"\",IF(OR(P831>0,O831=\"Enter Watts\",P831=\"\"),P831*N831*(1-X831)/1000,O831*N831(1-X831)/1000)),IF(AND(E831=\"\",L831=\"\"),\"\",0))","v":""},"","","","","",null,null,0,{"$nulls":3},"No",{"$nulls":6},"","",null,""]
[null,813,{"$nulls":5},"",null,"",{"$nulls":4},"",null,"",null,"No",null,"",{"v":0,"d":"0.0000"},"",{"v":0,"d":"0.00"},{"$f":"IF(R832=\"Interior\",IF(AND(L832=\"\",E832=\"\"),\"\",IF(OR(P832>0,O832=\"Enter Watts\",P832=\"\"),P832*N832*(1-X832)/1000,O832*N832(1-X832)/1000)),IF(AND(E832=\"\",L832=\"\"),\"\",0))","v":""},"","","","","",null,null,0,{"$nulls":3},"No"]
[null,814,{"$nulls":5},{"$f":"IF(E833=\"\",\"\",VLOOKUP(E833,$AQ$1114:$AR$1541,2,FALSE))","v":""},null,"",{"$nulls":4},"",null,"",null,"No",null,"",{"v":0,"d":"0.0000"},"",{"v":0,"d":"0.00"},{"$f":"IF(R833=\"Interior\",IF(AND(L833=\"\",E833=\"\"),\"\",IF(OR(P833>0,O833=\"Enter Watts\",P833=\"\"),P833*N833*(1-X833)/1000,O833*N833(1-X833)/1000)),IF(AND(E833=\"\",L833=\"\"),\"\",0))","v":""},"","","","",{"$f":"IF(AC833=\"\",\"\",IF(AND(R833=\"Interior\",S833=\"No\",OR(T833=\"\",T833=\"No\")),$J$1027,IF(AND(R833=\"Interior\",S833=\"Yes\"),$J$1028,IF(AND(R833=\"Exterior\",S833=\"Yes\"),$J$1029,IF(AND(R833=\"Exterior\",S833=\"No\",N833<>G833),\"DNQ\",\"See Lighting Catalog to determine Code\")))))","v":""},null,null,0,{"$nulls":3},"No"]
[null,815,{"$nulls":5},"",null,"",{"$nulls":4},"",null,"",null,"No",null,"",{"v":0,"d":"0.0000"},"",{"v":0,"d":"0.00"},{"$f":"IF(R834=\"Interior\",IF(AND(L834=\"\",E834=\"\"),\"\",IF(OR(P834>0,O834=\"Enter Watts\",P834=\"\"),P834*N834*(1-X834)/1000,O834*N834(1-X834)/1000)),IF(AND(E834=\"\",L834=\"\"),\"\",0))","v":""},"","","","","",null,null,0,{"$nulls":3},"No"]
[null,816,{"$nulls":5},"",null,"",{"$nulls":4},"",null,"",null,"No",null,"",{"v":0,"d":"0.0000"},"",{"v":0,"d":"0.00"},{"$f":"IF(R835=\"Interior\",IF(AND(L835=\"\",E835=\"\"),\"\",IF(OR(P835>0,O835=\"Enter Watts\",P835=\"\"),P835*N835*(1-X835)/1000,O835*N835(1-X835)/1000)),IF(AND(E835=\"\",L835=\"\"),\"\",0))","v":""},"","","","","",null,null,0,{"$nulls":3},"No"]
[null,817,{"$nulls":5},"",null,"",{"$nulls":4},"",null,"",null,"No",null,"",{"v":0,"d":"0.0000"},"",{"v":0,"d":"0.00"},{"$f":"IF(R836=\"Interior\",IF(AND(L836=\"\",E836=\"\"),\"\",IF(OR(P836>0,O836=\"Enter Watts\",P836=\"\"),P836*N836*(1-X836)/1000,O836*N836(1-X836)/1000)),IF(AND(E836=\"\",L836=\"\"),\"\",0))","v":""},"","","","","",null,null,0,{"$nulls":3},"No"]
[null,818,{"$nulls":5},"",null,"",{"$nulls":4},"",null,"",null,"No",null,"",{"v":0,"d":"0.0000"},"",{"v":0,"d":"0.00"},{"$f":"IF(R837=\"Interior\",IF(AND(L837=\"\",E837=\"\"),\"\",IF(OR(P837>0,O837=\"Enter Watts\",P837=\"\"),P837*N837*(1-X837)/1000,O837*N837(1-X837)/1000)),IF(AND(E837=\"\",L837=\"\"),\"\",0))","v":""},"","","","","",null,null,0,{"$nulls":3},"No"]
[null,819,{"$nulls":5},"",null,"",{"$nulls":4},"",null,"",null,"No",null,"",{"v":0,"d":"0.0000"},"",{"v":0,"d":"0.00"},{"$f":"IF(R838=\"Interior\",IF(AND(L838=\"\",E838=\"\"),\"\",IF(OR(P838>0,O838=\"Enter Watts\",P838=\"\"),P838*N838*(1-X838)/1000,O838*N838(1-X838)/1000)),IF(AND(E838=\"\",L838=\"\"),\"\",0))","v":""},"","","","","",null,null,0,{"$nulls":3},"No",{"$nulls":6},"","",null,""]
[null,820,{"$nulls":5},"",null,"",{"$nulls":4},"",null,"",null,"No",null,"",{"v":0,"d":"0.0000"},"",{"v":0,"d":"0.00"},{"$f":"IF(R839=\"Interior\",IF(AND(L839=\"\",E839=\"\"),\"\",IF(OR(P839>0,O839=\"Enter Watts\",P839=\"\"),P839*N839*(1-X839)/1000,O839*N839(1-X839)/1000)),IF(AND(E839=\"\",L839=\"\"),\"\",0))","v":""},"","","","","",null,null,0,{"$nulls":3},"No"]
[null,821,{"$nulls":5},"",null,"",{"$nulls":4},"",null,"",null,"No",null,"",{"v":0,"d":"0.0000"},"",{"v":0,"d":"0.00"},{"$f":"IF(R840=\"Interior\",IF(AND(L840=\"\",E840=\"\"),\"\",IF(OR(P840>0,O840=\"Enter Watts\",P840=\"\"),P840*N840*(1-X840)/1000,O840*N840(1-X840)/1000)),IF(AND(E840=\"\",L840=\"\"),\"\",0))","v":""},"","","","","",null,null,0,{"$nulls":3},"No"]
[null,822,{"$nulls":5},"",null,"",{"$nulls":4},"",null,"",null,"No",null,"",{"v":0,"d":"0.0000"},"",{"v":0,"d":"0.00"},{"$f":"IF(R841=\"Interior\",IF(AND(L841=\"\",E841=\"\"),\"\",IF(OR(P841>0,O841=\"Enter Watts\",P841=\"\"),P841*N841*(1-X841)/1000,O841*N841(1-X841)/1000)),IF(AND(E841=\"\",L841=\"\"),\"\",0))","v":""},"","","","","",null,null,0,{"$nulls":3},"No"]
[null,823,{"$nulls":5},"",null,"",{"$nulls":4},"",null,"",null,"No",null,"",{"v":0,"d":"0.0000"},"",{"v":0,"d":"0.00"},{"$f":"IF(R842=\"Interior\",IF(AND(L842=\"\",E842=\"\"),\"\",IF(OR(P842>0,O842=\"Enter Watts\",P842=\"\"),P842*N842*(1-X842)/1000,O842*N842(1-X842)/1000)),IF(AND(E842=\"\",L842=\"\"),\"\",0))","v":""},"","","","","",null,null,0,{"$nulls":3},"No"]
[null,824,{"$nulls":5},"",null,"",{"$nulls":4},"",null,"",null,"No",null,"",{"v":0,"d":"0.0000"},"",{"v":0,"d":"0.00"},{"$f":"IF(R843=\"Interior\",IF(AND(L843=\"\",E843=\"\"),\"\",IF(OR(P843>0,O843=\"Enter Watts\",P843=\"\"),P843*N843*(1-X843)/1000,O843*N843(1-X843)/1000)),IF(AND(E843=\"\",L843=\"\"),\"\",0))","v":""},"","","","","",null,null,0,{"$nulls":3},"No"]
[null,825,{"$nulls":5},"",null,"",{"$nulls":4},"",null,"",null,"No",null,"",{"v":0,"d":"0.0000"},"",{"v":0,"d":"0.00"},{"$f":"IF(R844=\"Interior\",IF(AND(L844=\"\",E844=\"\"),\"\",IF(OR(P844>0,O844=\"Enter Watts\",P844=\"\"),P844*N844*(1-X844)/1000,O844*N844(1-X844)/1000)),IF(AND(E844=\"\",L844=\"\"),\"\",0))","v":""},"","","","","",null,null,0,{"$nulls":3},"No",{"$nulls":6},"","",null,""]
[null,826,{"$nulls":5},"",null,"",{"$nulls":4},"",null,"",null,"No",null,"",{"v":0,"d":"0.0000"},"",{"v":0,"d":"0.00"},{"$f":"IF(R845=\"Interior\",IF(AND(L845=\"\",E845=\"\"),\"\",IF(OR(P845>0,O845=\"Enter Watts\",P845=\"\"),P845*N845*(1-X845)/1000,O845*N845(1-X845)/1000)),IF(AND(E845=\"\",L845=\"\"),\"\",0))","v":""},"","","","","",null,null,0,{"$nulls":3},"No"]
[null,827,{"$nulls":5},"",null,"",{"$nulls":4},"",null,"",null,"No",null,"",{"v":0,"d":"0.0000"},"",{"v":0,"d":"0.00"},{"$f":"IF(R846=\"Interior\",IF(AND(L846=\"\",E846=\"\"),\"\",IF(OR(P846>0,O846=\"Enter Watts\",P846=\"\"),P846*N846*(1-X846)/1000,O846*N846(1-X846)/1000)),IF(AND(E846=\"\",L846=\"\"),\"\",0))","v":""},"","","","","",null,null,0,{"$nulls":3},"No"]
[null,828,{"$nulls":5},"",null,"",{"$nulls":4},"",null,"",null,"No",null,"",{"v":0,"d":"0.0000"},"",{"v":0,"d":"0.00"},{"$f":"IF(R847=\"Interior\",IF(AND(L847=\"\",E847=\"\"),\"\",IF(OR(P847>0,O847=\"Enter Watts\",P847=\"\"),P847*N847*(1-X847)/1000,O847*N847(1-X847)/1000)),IF(AND(E847=\"\",L847=\"\"),\"\",0))","v":""},"","","","","",null,null,0,{"$nulls":3},"No"]
[null,829,{"$nulls":5},"",null,"",{"$nulls":4},"",null,"",null,"No",null,"",{"v":0,"d":"0.0000"},"",{"v":0,"d":"0.00"},{"$f":"IF(R848=\"Interior\",IF(AND(L848=\"\",E848=\"\"),\"\",IF(OR(P848>0,O848=\"Enter Watts\",P848=\"\"),P848*N848*(1-X848)/1000,O848*N848(1-X848)/1000)),IF(AND(E848=\"\",L848=\"\"),\"\",0))","v":""},"","","","","",null,null,0,{"$nulls":3},"No"]
[null,830,{"$nulls":5},"",null,"",{"$nulls":4},"",null,"",null,"No",null,"",{"v":0,"d":"0.0000"},"",{"v":0,"d":"0.00"},{"$f":"IF(R849=\"Interior\",IF(AND(L849=\"\",E849=\"\"),\"\",IF(OR(P849>0,O849=\"Enter Watts\",P849=\"\"),P849*N849*(1-X849)/1000,O849*N849(1-X849)/1000)),IF(AND(E849=\"\",L849=\"\"),\"\",0))","v":""},"","","","","",null,null,0,{"$nulls":3},"No"]
[null,831,{"$nulls":5},"",null,"",{"$nulls":4},"",null,"",null,"No",null,"",{"v":0,"d":"0.0000"},"",{"v":0,"d":"0.00"},{"$f":"IF(R850=\"Interior\",IF(AND(L850=\"\",E850=\"\"),\"\",IF(OR(P850>0,O850=\"Enter Watts\",P850=\"\"),P850*N850*(1-X850)/1000,O850*N850(1-X850)/1000)),IF(AND(E850=\"\",L850=\"\"),\"\",0))","v":""},"","","","","",null,null,0,{"$nulls":3},"No"]
[null,832,{"$nulls":5},"",null,"",{"$nulls":4},"",null,"",null,"No",null,"",{"v":0,"d":"0.0000"},"",{"v":0,"d":"0.00"},{"$f":"IF(R851=\"Interior\",IF(AND(L851=\"\",E851=\"\"),\"\",IF(OR(P851>0,O851=\"Enter Watts\",P851=\"\"),P851*N851*(1-X851)/1000,O851*N851(1-X851)/1000)),IF(AND(E851=\"\",L851=\"\"),\"\",0))","v":""},"","","","","",null,null,0,{"$nulls":3},"No"]
[null,833,{"$nulls":5},"",null,{"$f":"IF(AND(E852<>\"\",G852<>\"\",$E$8=\"Default Sector Hours\"),VLOOKUP(IF(R852=\"Exterior\",\"Exterior\",$E$7),$W$1036:$X$1041,2,FALSE),\"\")","v":""},{"$nulls":4},{"$f":"IF(L852=\"\",\"\",VLOOKUP(L852,$AQ$1113:$AR$1541,2,FALSE))","v":""},null,"",null,"No",null,"",{"v":0,"d":"0.0000"},"",{"v":0,"d":"0.00"},{"$f":"IF(R852=\"Interior\",IF(AND(L852=\"\",E852=\"\"),\"\",IF(OR(P852>0,O852=\"Enter Watts\",P852=\"\"),P852*N852*(1-X852)/1000,O852*N852(1-X852)/1000)),IF(AND(E852=\"\",L852=\"\"),\"\",0))","v":""},{"$f":"IFERROR(IF(AND(L852=\"\", E852=\"\"),\"\",N852/1000*IF(OR(P852>0,O852=\"Enter Watts\"),P852,O852)*IF(R852=\"Exterior\",$X$1041,IF($E$8=\"Manual Input\",Q852,VLOOKUP($E$7,$W$1036:$Z$1040,2,FALSE)))*IF(S852=\"Yes\",IF(R852=\"Exterior\",1-$Z$1041,1-VLOOKUP($E$7,$W$1036:$Z$1040,4,FALSE)),1)),0)","v":""},"",{"$f":"IF(AND(U852=\"\",Y852=\"\"),\"\",IF(OR(U852=\"\",Y852=\"\"),0,  IF($E$8=\"Manual Input\",$G$9,   VLOOKUP($E$7,$W$1036:$Z$1041,3,FALSE))     *(U852-Y852)))","v":""},"","",null,null,0,{"$nulls":3},"No"]
[null,834,{"$nulls":5},"",null,"",{"$nulls":4},"",null,"",null,"No",null,{"$f":"IF(V853=\"Int Control\",IF(E853=\"\",\"\",IF(OR(I853>0,H853=\"Enter Watts\"),I853*G853/1000*(1-$E$15),H853*G853/1000*(1-$E$15))),IF(E853=\"\",\"\",IF(OR(I853>0,H853=\"Enter Watts\"),I853*G853/1000,H853*G853/1000)))","v":""},{"$f":"IF(AND(R853=\"Interior\",S853=\"Yes\"),\"Int Control\",0)","v":{"v":0,"d":"0.0000"}},{"$f":"IFERROR(IF(V853=\"Int Control\",IF(E853=\"\",\"\",G853/1000*(1-$E$15)*IF(OR(I853>0,H853=\"Enter Watts\"),I853,H853)*IF(R853=\"Exterior\",$X$1041*(1-$G$15),IF($E$8=\"Manual Input\",J853,VLOOKUP($E$7,$W$1036:$Z$1040,2,FALSE)*(1-$E$15)))),IF(E853=\"\",\"\",G853/1000*IF(OR(I853>0,H853=\"Enter Watts\"),I853,H853)*IF(R853=\"Exterior\",$X$1041,IF($E$8=\"Manual Input\",J853,VLOOKUP($E$7,$W$1036:$Z$1040,2,FALSE))))),\"0\")","v":""},{"$f":"IF(S853=\"No\",0,AA$1036)","v":{"v":0,"d":"0.00"}},{"$f":"IF(R853=\"Interior\",IF(AND(L853=\"\",E853=\"\"),\"\",IF(OR(P853>0,O853=\"Enter Watts\",P853=\"\"),P853*N853*(1-X853)/1000,O853*N853(1-X853)/1000)),IF(AND(E853=\"\",L853=\"\"),\"\",0))","v":""},"","","","","",null,null,{"$f":"AF853*N853","v":0},{"$nulls":3},{"$f":"IF(_xlfn.ISFORMULA(J853)=TRUE,\"No\",\"Yes\")","v":"No"}]
[null,835,{"$nulls":5},"",null,"",{"$nulls":4},"",null,"",null,"No",null,"",{"v":0,"d":"0.0000"},"",{"v":0,"d":"0.00"},{"$f":"IF(R854=\"Interior\",IF(AND(L854=\"\",E854=\"\"),\"\",IF(OR(P854>0,O854=\"Enter Watts\",P854=\"\"),P854*N854*(1-X854)/1000,O854*N854(1-X854)/1000)),IF(AND(E854=\"\",L854=\"\"),\"\",0))","v":""},"","","","","",null,null,0,{"$nulls":3},"No"]
[null,836,{"$nulls":5},"",null,"",{"$nulls":4},"",null,"",null,"No",null,"",{"v":0,"d":"0.0000"},"",{"v":0,"d":"0.00"},{"$f":"IF(R855=\"Interior\",IF(AND(L855=\"\",E855=\"\"),\"\",IF(OR(P855>0,O855=\"Enter Watts\",P855=\"\"),P855*N855*(1-X855)/1000,O855*N855(1-X855)/1000)),IF(AND(E855=\"\",L855=\"\"),\"\",0))","v":""},"","","","","",null,null,0,{"$nulls":3},"No"]
[null,837,{"$nulls":5},"",null,"",{"$nulls":4},"",null,"",null,"No",null,"",{"v":0,"d":"0.0000"},"",{"v":0,"d":"0.00"},{"$f":"IF(R856=\"Interior\",IF(AND(L856=\"\",E856=\"\"),\"\",IF(OR(P856>0,O856=\"Enter Watts\",P856=\"\"),P856*N856*(1-X856)/1000,O856*N856(1-X856)/1000)),IF(AND(E856=\"\",L856=\"\"),\"\",0))","v":""},"","","","","",null,null,0,{"$nulls":3},"No",{"$nulls":6},"","",null,""]
[null,838,{"$nulls":5},"",null,"",{"$nulls":4},"",null,"",null,"No",null,"",{"v":0,"d":"0.0000"},"",{"v":0,"d":"0.00"},{"$f":"IF(R857=\"Interior\",IF(AND(L857=\"\",E857=\"\"),\"\",IF(OR(P857>0,O857=\"Enter Watts\",P857=\"\"),P857*N857*(1-X857)/1000,O857*N857(1-X857)/1000)),IF(AND(E857=\"\",L857=\"\"),\"\",0))","v":""},"","","","","",null,null,0,{"$nulls":3},"No"]
[null,839,{"$nulls":5},"",null,"",{"$nulls":4},"",null,"",null,"No",null,"",{"v":0,"d":"0.0000"},"",{"v":0,"d":"0.00"},{"$f":"IF(R858=\"Interior\",IF(AND(L858=\"\",E858=\"\"),\"\",IF(OR(P858>0,O858=\"Enter Watts\",P858=\"\"),P858*N858*(1-X858)/1000,O858*N858(1-X858)/1000)),IF(AND(E858=\"\",L858=\"\"),\"\",0))","v":""},"","","","","",null,null,0,{"$nulls":3},"No"]
[null,840,{"$nulls":5},"",null,"",{"$nulls":4},"",null,"",null,"No",null,"",{"v":0,"d":"0.0000"},"",{"v":0,"d":"0.00"},{"$f":"IF(R859=\"Interior\",IF(AND(L859=\"\",E859=\"\"),\"\",IF(OR(P859>0,O859=\"Enter Watts\",P859=\"\"),P859*N859*(1-X859)/1000,O859*N859(1-X859)/1000)),IF(AND(E859=\"\",L859=\"\"),\"\",0))","v":""},"","","","","",null,null,0,{"$nulls":3},"No"]
[null,841,{"$nulls":5},"",null,"",{"$nulls":4},"",null,"",null,"No",null,"",{"v":0,"d":"0.0000"},"",{"v":0,"d":"0.00"},{"$f":"IF(R860=\"Interior\",IF(AND(L860=\"\",E860=\"\"),\"\",IF(OR(P860>0,O860=\"Enter Watts\",P860=\"\"),P860*N860*(1-X860)/1000,O860*N860(1-X860)/1000)),IF(AND(E860=\"\",L860=\"\"),\"\",0))","v":""},"","","","","",null,null,0,{"$nulls":3},"No"]
[null,842,{"$nulls":5},"",null,"",{"$nulls":4},"",null,"",null,"No",null,"",{"v":0,"d":"0.0000"},"",{"v":0,"d":"0.00"},{"$f":"IF(R861=\"Interior\",IF(AND(L861=\"\",E861=\"\"),\"\",IF(OR(P861>0,O861=\"Enter Watts\",P861=\"\"),P861*N861*(1-X861)/1000,O861*N861(1-X861)/1000)),IF(AND(E861=\"\",L861=\"\"),\"\",0))","v":""},"","","","","",null,null,0,{"$nulls":3},"No"]
[null,843,{"$nulls":5},"",null,"",{"$nulls":4},"",null,"",null,"No",null,"",{"v":0,"d":"0.0000"},"",{"v":0,"d":"0.00"},{"$f":"IF(R862=\"Interior\",IF(AND(L862=\"\",E862=\"\"),\"\",IF(OR(P862>0,O862=\"Enter Watts\",P862=\"\"),P862*N862*(1-X862)/1000,O862*N862(1-X862)/1000)),IF(AND(E862=\"\",L862=\"\"),\"\",0))","v":""},"","","","","",null,null,0,{"$nulls":3},"No",{"$nulls":6},"","",null,""]
[null,844,{"$nulls":5},"",null,"",{"$nulls":4},"",null,"",null,"No",null,"",{"v":0,"d":"0.0000"},"",{"v":0,"d":"0.00"},{"$f":"IF(R863=\"Interior\",IF(AND(L863=\"\",E863=\"\"),\"\",IF(OR(P863>0,O863=\"Enter Watts\",P863=\"\"),P863*N863*(1-X863)/1000,O863*N863(1-X863)/1000)),IF(AND(E863=\"\",L863=\"\"),\"\",0))","v":""},"","","","","",null,null,0,{"$nulls":3},"No"]
[null,845,{"$nulls":5},"",null,"",{"$nulls":4},"",null,"",null,"No",null,"",{"v":0,"d":"0.0000"},"",{"v":0,"d":"0.00"},{"$f":"IF(R864=\"Interior\",IF(AND(L864=\"\",E864=\"\"),\"\",IF(OR(P864>0,O864=\"Enter Watts\",P864=\"\"),P864*N864*(1-X864)/1000,O864*N864(1-X864)/1000)),IF(AND(E864=\"\",L864=\"\"),\"\",0))","v":""},"","","","","",null,null,0,{"$nulls":3},"No"]
[null,846,{"$nulls":5},"",null,"",{"$nulls":4},"",null,"",null,"No",null,"",{"v":0,"d":"0.0000"},"",{"v":0,"d":"0.00"},{"$f":"IF(R865=\"Interior\",IF(AND(L865=\"\",E865=\"\"),\"\",IF(OR(P865>0,O865=\"Enter Watts\",P865=\"\"),P865*N865*(1-X865)/1000,O865*N865(1-X865)/1000)),IF(AND(E865=\"\",L865=\"\"),\"\",0))","v":""},"","","","","",null,null,0,{"$nulls":3},"No"]
[null,847,{"$nulls":5},"",null,"",{"$nulls":4},"",null,"",null,"No",null,"",{"v":0,"d":"0.0000"},"",{"v":0,"d":"0.00"},{"$f":"IF(R866=\"Interior\",IF(AND(L866=\"\",E866=\"\"),\"\",IF(OR(P866>0,O866=\"Enter Watts\",P866=\"\"),P866*N866*(1-X866)/1000,O866*N866(1-X866)/1000)),IF(AND(E866=\"\",L866=\"\"),\"\",0))","v":""},"","","","","",null,null,0,{"$nulls":3},"No"]
[null,848,{"$nulls":5},"",null,"",{"$nulls":4},"",null,"",null,"No",null,"",{"v":0,"d":"0.0000"},"",{"v":0,"d":"0.00"},{"$f":"IF(R867=\"Interior\",IF(AND(L867=\"\",E867=\"\"),\"\",IF(OR(P867>0,O867=\"Enter Watts\",P867=\"\"),P867*N867*(1-X867)/1000,O867*N867(1-X867)/1000)),IF(AND(E867=\"\",L867=\"\"),\"\",0))","v":""},"","","","","",null,null,0,{"$nulls":3},"No"]
[null,849,{"$nulls":5},"",null,"",{"$nulls":4},"",null,"",null,"No",null,"",{"v":0,"d":"0.0000"},"",{"v":0,"d":"0.00"},{"$f":"IF(R868=\"Interior\",IF(AND(L868=\"\",E868=\"\"),\"\",IF(OR(P868>0,O868=\"Enter Watts\",P868=\"\"),P868*N868*(1-X868)/1000,O868*N868(1-X868)/1000)),IF(AND(E868=\"\",L868=\"\"),\"\",0))","v":""},"","","","","",null,null,0,{"$nulls":3},"No"]
[null,850,{"$nulls":5},"",null,"",{"$nulls":4},"",null,"",null,"No",null,"",{"v":0,"d":"0.0000"},"",{"v":0,"d":"0.00"},{"$f":"IF(R869=\"Interior\",IF(AND(L869=\"\",E869=\"\"),\"\",IF(OR(P869>0,O869=\"Enter Watts\",P869=\"\"),P869*N869*(1-X869)/1000,O869*N869(1-X869)/1000)),IF(AND(E869=\"\",L869=\"\"),\"\",0))","v":""},"",{"$f":"IFERROR(IF(OR(I869>0,H869=\"Enter Watts\"),I869*G869,H869*G869)-IF(OR(P869>0,O869=\"Enter Watts\"),P869*N869,O869*N869),\"\")","v":""},"",{"$f":"IF(AND(W869=\"\",Z869=\"\"),\"\",IF(OR(W869=\"\",Z869=\"\"),0,W869-Z869))","v":""},"",null,null,0,{"$nulls":3},"No"]
[null,851,{"$nulls":5},"",null,"",{"$nulls":4},"",null,"",null,"No",null,"",{"v":0,"d":"0.0000"},"",{"v":0,"d":"0.00"},{"$f":"IF(R870=\"Interior\",IF(AND(L870=\"\",E870=\"\"),\"\",IF(OR(P870>0,O870=\"Enter Watts\",P870=\"\"),P870*N870*(1-X870)/1000,O870*N870(1-X870)/1000)),IF(AND(E870=\"\",L870=\"\"),\"\",0))","v":""},"",{"$f":"IFERROR(IF(OR(I870>0,H870=\"Enter Watts\"),I870*G870,H870*G870)-IF(OR(P870>0,O870=\"Enter Watts\"),P870*N870,O870*N870),\"\")","v":""},"",{"$f":"IF(AND(W870=\"\",Z870=\"\"),\"\",IF(OR(W870=\"\",Z870=\"\"),0,W870-Z870))","v":""},"",null,null,0,{"$nulls":3},"No"]
[null,852,{"$nulls":5},"",null,"",{"$nulls":4},"",null,"",null,"No",null,"",{"v":0,"d":"0.0000"},"",{"v":0,"d":"0.00"},{"$f":"IF(R871=\"Interior\",IF(AND(L871=\"\",E871=\"\"),\"\",IF(OR(P871>0,O871=\"Enter Watts\",P871=\"\"),P871*N871*(1-X871)/1000,O871*N871(1-X871)/1000)),IF(AND(E871=\"\",L871=\"\"),\"\",0))","v":""},"","","","","",null,null,0,{"$nulls":3},"No"]
[null,853,{"$nulls":5},"",null,"",{"$nulls":4},"",null,"",null,"No",null,"",{"v":0,"d":"0.0000"},"",{"v":0,"d":"0.00"},{"$f":"IF(R872=\"Interior\",IF(AND(L872=\"\",E872=\"\"),\"\",IF(OR(P872>0,O872=\"Enter Watts\",P872=\"\"),P872*N872*(1-X872)/1000,O872*N872(1-X872)/1000)),IF(AND(E872=\"\",L872=\"\"),\"\",0))","v":""},"","","","","",null,null,0,{"$nulls":3},"No"]
[null,854,{"$nulls":5},"",null,"",{"$nulls":4},"",null,"",null,"No",null,"",{"v":0,"d":"0.0000"},"",{"v":0,"d":"0.00"},{"$f":"IF(R873=\"Interior\",IF(AND(L873=\"\",E873=\"\"),\"\",IF(OR(P873>0,O873=\"Enter Watts\",P873=\"\"),P873*N873*(1-X873)/1000,O873*N873(1-X873)/1000)),IF(AND(E873=\"\",L873=\"\"),\"\",0))","v":""},"","","","","",null,null,0,{"$nulls":3},"No",{"$nulls":6},"","",null,""]
[null,855,{"$nulls":5},"",null,"",{"$nulls":4},"",null,"",null,"No",null,"",{"v":0,"d":"0.0000"},"",{"v":0,"d":"0.00"},{"$f":"IF(R874=\"Interior\",IF(AND(L874=\"\",E874=\"\"),\"\",IF(OR(P874>0,O874=\"Enter Watts\",P874=\"\"),P874*N874*(1-X874)/1000,O874*N874(1-X874)/1000)),IF(AND(E874=\"\",L874=\"\"),\"\",0))","v":""},"","","","","",null,null,0,{"$nulls":3},"No"]
[null,856,{"$nulls":5},"",null,"",{"$nulls":4},"",null,"",null,"No",null,"",{"v":0,"d":"0.0000"},"",{"v":0,"d":"0.00"},{"$f":"IF(R875=\"Interior\",IF(AND(L875=\"\",E875=\"\"),\"\",IF(OR(P875>0,O875=\"Enter Watts\",P875=\"\"),P875*N875*(1-X875)/1000,O875*N875(1-X875)/1000)),IF(AND(E875=\"\",L875=\"\"),\"\",0))","v":""},"","","","","",null,null,0,{"$nulls":3},"No"]
[null,857,{"$nulls":5},"",null,"",{"$nulls":4},"",null,"",null,"No",null,"",{"v":0,"d":"0.0000"},"",{"v":0,"d":"0.00"},{"$f":"IF(R876=\"Interior\",IF(AND(L876=\"\",E876=\"\"),\"\",IF(OR(P876>0,O876=\"Enter Watts\",P876=\"\"),P876*N876*(1-X876)/1000,O876*N876(1-X876)/1000)),IF(AND(E876=\"\",L876=\"\"),\"\",0))","v":""},"","","","","",null,null,0,{"$nulls":3},"No"]
[null,858,{"$nulls":5},"",null,"",{"$nulls":4},"",null,"",null,"No",null,"",{"v":0,"d":"0.0000"},"",{"v":0,"d":"0.00"},{"$f":"IF(R877=\"Interior\",IF(AND(L877=\"\",E877=\"\"),\"\",IF(OR(P877>0,O877=\"Enter Watts\",P877=\"\"),P877*N877*(1-X877)/1000,O877*N877(1-X877)/1000)),IF(AND(E877=\"\",L877=\"\"),\"\",0))","v":""},"","","","","",null,null,0,{"$nulls":3},"No"]
[null,859,{"$nulls":5},"",null,"",{"$nulls":4},"",null,"",null,"No",null,"",{"v":0,"d":"0.0000"},"",{"v":0,"d":"0.00"},{"$f":"IF(R878=\"Interior\",IF(AND(L878=\"\",E878=\"\"),\"\",IF(OR(P878>0,O878=\"Enter Watts\",P878=\"\"),P878*N878*(1-X878)/1000,O878*N878(1-X878)/1000)),IF(AND(E878=\"\",L878=\"\"),\"\",0))","v":""},"","","","","",null,null,0,{"$nulls":3},"No"]
[null,860,{"$nulls":5},"",null,"",{"$nulls":4},"",null,"",null,"No",null,"",{"v":0,"d":"0.0000"},"",{"v":0,"d":"0.00"},{"$f":"IF(R879=\"Interior\",IF(AND(L879=\"\",E879=\"\"),\"\",IF(OR(P879>0,O879=\"Enter Watts\",P879=\"\"),P879*N879*(1-X879)/1000,O879*N879(1-X879)/1000)),IF(AND(E879=\"\",L879=\"\"),\"\",0))","v":""},"","","","","",null,null,0,{"$nulls":3},"No",{"$nulls":6},"","",null,""]
[null,861,{"$nulls":5},"",null,"",{"$nulls":4},"",null,"",null,"No",null,"",{"v":0,"d":"0.0000"},"",{"v":0,"d":"0.00"},{"$f":"IF(R880=\"Interior\",IF(AND(L880=\"\",E880=\"\"),\"\",IF(OR(P880>0,O880=\"Enter Watts\",P880=\"\"),P880*N880*(1-X880)/1000,O880*N880(1-X880)/1000)),IF(AND(E880=\"\",L880=\"\"),\"\",0))","v":""},"","","","","",null,null,0,{"$nulls":3},"No"]
[null,862,{"$nulls":5},"",null,"",{"$nulls":4},"",null,"",null,"No",null,"",{"v":0,"d":"0.0000"},"",{"v":0,"d":"0.00"},{"$f":"IF(R881=\"Interior\",IF(AND(L881=\"\",E881=\"\"),\"\",IF(OR(P881>0,O881=\"Enter Watts\",P881=\"\"),P881*N881*(1-X881)/1000,O881*N881(1-X881)/1000)),IF(AND(E881=\"\",L881=\"\"),\"\",0))","v":""},"","","","","",null,null,0,{"$nulls":3},"No"]
[null,863,{"$nulls":5},"",null,"",{"$nulls":4},"",null,"",null,"No",null,"",{"v":0,"d":"0.0000"},"",{"v":0,"d":"0.00"},{"$f":"IF(R882=\"Interior\",IF(AND(L882=\"\",E882=\"\"),\"\",IF(OR(P882>0,O882=\"Enter Watts\",P882=\"\"),P882*N882*(1-X882)/1000,O882*N882(1-X882)/1000)),IF(AND(E882=\"\",L882=\"\"),\"\",0))","v":""},"","","","","",null,null,0,{"$nulls":3},"No"]
[null,864,{"$nulls":5},"",null,"",{"$nulls":4},"",null,"",null,"No",null,"",{"v":0,"d":"0.0000"},"",{"v":0,"d":"0.00"},{"$f":"IF(R883=\"Interior\",IF(AND(L883=\"\",E883=\"\"),\"\",IF(OR(P883>0,O883=\"Enter Watts\",P883=\"\"),P883*N883*(1-X883)/1000,O883*N883(1-X883)/1000)),IF(AND(E883=\"\",L883=\"\"),\"\",0))","v":""},"","","","","",null,null,0,{"$nulls":3},"No"]
[null,865,{"$nulls":5},"",null,"",{"$nulls":4},"",null,"",null,"No",null,"",{"v":0,"d":"0.0000"},"",{"v":0,"d":"0.00"},{"$f":"IF(R884=\"Interior\",IF(AND(L884=\"\",E884=\"\"),\"\",IF(OR(P884>0,O884=\"Enter Watts\",P884=\"\"),P884*N884*(1-X884)/1000,O884*N884(1-X884)/1000)),IF(AND(E884=\"\",L884=\"\"),\"\",0))","v":""},"","","","","",null,null,0,{"$nulls":3},"No"]
[null,866,{"$nulls":5},"",null,"",{"$nulls":4},"",null,"",null,"No",null,"",{"v":0,"d":"0.0000"},"",{"v":0,"d":"0.00"},{"$f":"IF(R885=\"Interior\",IF(AND(L885=\"\",E885=\"\"),\"\",IF(OR(P885>0,O885=\"Enter Watts\",P885=\"\"),P885*N885*(1-X885)/1000,O885*N885(1-X885)/1000)),IF(AND(E885=\"\",L885=\"\"),\"\",0))","v":""},"","","","","",null,null,0,{"$nulls":3},"No"]
[null,867,{"$nulls":5},"",null,"",{"$nulls":4},"",null,"",null,"No",null,"",{"v":0,"d":"0.0000"},"",{"v":0,"d":"0.00"},{"$f":"IF(R886=\"Interior\",IF(AND(L886=\"\",E886=\"\"),\"\",IF(OR(P886>0,O886=\"Enter Watts\",P886=\"\"),P886*N886*(1-X886)/1000,O886*N886(1-X886)/1000)),IF(AND(E886=\"\",L886=\"\"),\"\",0))","v":""},"","","","","",null,null,0,{"$nulls":3},"No",{"$nulls":6},"","",null,""]
[null,868,{"$nulls":5},"",null,"",{"$nulls":4},"",null,"",null,"No",null,"",{"v":0,"d":"0.0000"},"",{"v":0,"d":"0.00"},{"$f":"IF(R887=\"Interior\",IF(AND(L887=\"\",E887=\"\"),\"\",IF(OR(P887>0,O887=\"Enter Watts\",P887=\"\"),P887*N887*(1-X887)/1000,O887*N887(1-X887)/1000)),IF(AND(E887=\"\",L887=\"\"),\"\",0))","v":""},"","","","","",null,null,0,{"$nulls":3},"No"]
[null,869,{"$nulls":5},"",null,"",{"$nulls":4},"",null,"",null,"No",null,"",{"v":0,"d":"0.0000"},"",{"v":0,"d":"0.00"},{"$f":"IF(R888=\"Interior\",IF(AND(L888=\"\",E888=\"\"),\"\",IF(OR(P888>0,O888=\"Enter Watts\",P888=\"\"),P888*N888*(1-X888)/1000,O888*N888(1-X888)/1000)),IF(AND(E888=\"\",L888=\"\"),\"\",0))","v":""},"","","","","",null,null,0,{"$nulls":3},"No"]
[null,870,{"$nulls":5},"",null,"",{"$nulls":4},"",null,"",null,"No",null,"",{"v":0,"d":"0.0000"},"",{"v":0,"d":"0.00"},{"$f":"IF(R889=\"Interior\",IF(AND(L889=\"\",E889=\"\"),\"\",IF(OR(P889>0,O889=\"Enter Watts\",P889=\"\"),P889*N889*(1-X889)/1000,O889*N889(1-X889)/1000)),IF(AND(E889=\"\",L889=\"\"),\"\",0))","v":""},"","","","","",null,null,0,{"$nulls":3},"No"]
[null,871,{"$nulls":5},"",null,"",{"$nulls":4},"",null,"",null,"No",null,"",{"v":0,"d":"0.0000"},"",{"v":0,"d":"0.00"},{"$f":"IF(R890=\"Interior\",IF(AND(L890=\"\",E890=\"\"),\"\",IF(OR(P890>0,O890=\"Enter Watts\",P890=\"\"),P890*N890*(1-X890)/1000,O890*N890(1-X890)/1000)),IF(AND(E890=\"\",L890=\"\"),\"\",0))","v":""},"","","","","",null,null,0,{"$nulls":3},"No"]
[null,872,{"$nulls":5},"",null,"",{"$nulls":4},"",null,"",null,"No",null,"",{"v":0,"d":"0.0000"},"",{"v":0,"d":"0.00"},{"$f":"IF(R891=\"Interior\",IF(AND(L891=\"\",E891=\"\"),\"\",IF(OR(P891>0,O891=\"Enter Watts\",P891=\"\"),P891*N891*(1-X891)/1000,O891*N891(1-X891)/1000)),IF(AND(E891=\"\",L891=\"\"),\"\",0))","v":""},"","","","","",null,null,0,{"$nulls":3},"No"]
[null,873,{"$nulls":5},"",null,"",{"$nulls":4},"",null,"",null,"No",null,"",{"v":0,"d":"0.0000"},"",{"v":0,"d":"0.00"},{"$f":"IF(R892=\"Interior\",IF(AND(L892=\"\",E892=\"\"),\"\",IF(OR(P892>0,O892=\"Enter Watts\",P892=\"\"),P892*N892*(1-X892)/1000,O892*N892(1-X892)/1000)),IF(AND(E892=\"\",L892=\"\"),\"\",0))","v":""},"","","","","",null,null,0,{"$nulls":3},"No",{"$nulls":6},"","",null,""]
[null,874,{"$nulls":5},"",null,"",{"$nulls":4},"",null,"",null,"No",null,"",{"v":0,"d":"0.0000"},"",{"v":0,"d":"0.00"},{"$f":"IF(R893=\"Interior\",IF(AND(L893=\"\",E893=\"\"),\"\",IF(OR(P893>0,O893=\"Enter Watts\",P893=\"\"),P893*N893*(1-X893)/1000,O893*N893(1-X893)/1000)),IF(AND(E893=\"\",L893=\"\"),\"\",0))","v":""},"","","","","",null,null,0,{"$nulls":3},"No"]
[null,875,{"$nulls":5},"",null,"",{"$nulls":4},"",null,{"$f":"IF(J894=\"\",\"\",J894)","v":""},null,"No",null,"",{"v":0,"d":"0.0000"},"",{"v":0,"d":"0.00"},{"$f":"IF(R894=\"Interior\",IF(AND(L894=\"\",E894=\"\"),\"\",IF(OR(P894>0,O894=\"Enter Watts\",P894=\"\"),P894*N894*(1-X894)/1000,O894*N894(1-X894)/1000)),IF(AND(E894=\"\",L894=\"\"),\"\",0))","v":""},"","","","","",null,null,0,{"$nulls":3},"No"]
[null,876,{"$nulls":5},"",null,"",{"$nulls":4},"",null,"",null,"No",null,"",{"v":0,"d":"0.0000"},"",{"v":0,"d":"0.00"},{"$f":"IF(R895=\"Interior\",IF(AND(L895=\"\",E895=\"\"),\"\",IF(OR(P895>0,O895=\"Enter Watts\",P895=\"\"),P895*N895*(1-X895)/1000,O895*N895(1-X895)/1000)),IF(AND(E895=\"\",L895=\"\"),\"\",0))","v":""},"","","","","",null,null,0,{"$nulls":3},"No"]
[null,877,{"$nulls":5},"",null,"",{"$nulls":4},"",null,"",null,"No",null,"",{"v":0,"d":"0.0000"},"",{"v":0,"d":"0.00"},{"$f":"IF(R896=\"Interior\",IF(AND(L896=\"\",E896=\"\"),\"\",IF(OR(P896>0,O896=\"Enter Watts\",P896=\"\"),P896*N896*(1-X896)/1000,O896*N896(1-X896)/1000)),IF(AND(E896=\"\",L896=\"\"),\"\",0))","v":""},"","","","","",null,null,0,{"$nulls":3},"No"]
[null,878,{"$nulls":5},{"$f":"IF(E897=\"\",\"\",VLOOKUP(E897,$AQ$1114:$AR$1541,2,FALSE))","v":""},null,"",{"$nulls":4},"",null,"",null,"No",null,"",{"v":0,"d":"0.0000"},"",{"v":0,"d":"0.00"},{"$f":"IF(R897=\"Interior\",IF(AND(L897=\"\",E897=\"\"),\"\",IF(OR(P897>0,O897=\"Enter Watts\",P897=\"\"),P897*N897*(1-X897)/1000,O897*N897(1-X897)/1000)),IF(AND(E897=\"\",L897=\"\"),\"\",0))","v":""},"","","","",{"$f":"IF(AC897=\"\",\"\",IF(AND(R897=\"Interior\",S897=\"No\",OR(T897=\"\",T897=\"No\")),$J$1027,IF(AND(R897=\"Interior\",S897=\"Yes\"),$J$1028,IF(AND(R897=\"Exterior\",S897=\"Yes\"),$J$1029,IF(AND(R897=\"Exterior\",S897=\"No\",N897<>G897),\"DNQ\",\"See Lighting Catalog to determine Code\")))))","v":""},null,null,0,{"$nulls":3},"No"]
[null,879,{"$nulls":5},"",null,"",{"$nulls":4},"",null,"",null,"No",null,"",{"v":0,"d":"0.0000"},"",{"v":0,"d":"0.00"},{"$f":"IF(R898=\"Interior\",IF(AND(L898=\"\",E898=\"\"),\"\",IF(OR(P898>0,O898=\"Enter Watts\",P898=\"\"),P898*N898*(1-X898)/1000,O898*N898(1-X898)/1000)),IF(AND(E898=\"\",L898=\"\"),\"\",0))","v":""},"","","","","",null,null,0,{"$nulls":3},"No",{"$nulls":6},"","",null,""]
[null,880,{"$nulls":5},"",null,"",{"$nulls":4},"",null,"",null,"No",null,"",{"v":0,"d":"0.0000"},"",{"v":0,"d":"0.00"},{"$f":"IF(R899=\"Interior\",IF(AND(L899=\"\",E899=\"\"),\"\",IF(OR(P899>0,O899=\"Enter Watts\",P899=\"\"),P899*N899*(1-X899)/1000,O899*N899(1-X899)/1000)),IF(AND(E899=\"\",L899=\"\"),\"\",0))","v":""},"","","","","",null,null,0,{"$nulls":3},"No"]
[null,881,{"$nulls":5},"",null,"",{"$nulls":4},"",null,"",null,"No",null,"",{"v":0,"d":"0.0000"},"",{"v":0,"d":"0.00"},{"$f":"IF(R900=\"Interior\",IF(AND(L900=\"\",E900=\"\"),\"\",IF(OR(P900>0,O900=\"Enter Watts\",P900=\"\"),P900*N900*(1-X900)/1000,O900*N900(1-X900)/1000)),IF(AND(E900=\"\",L900=\"\"),\"\",0))","v":""},"","","","","",null,null,0,{"$nulls":3},"No"]
[null,882,{"$nulls":5},"",null,"",{"$nulls":4},"",null,"",null,"No",null,"",{"v":0,"d":"0.0000"},"",{"v":0,"d":"0.00"},{"$f":"IF(R901=\"Interior\",IF(AND(L901=\"\",E901=\"\"),\"\",IF(OR(P901>0,O901=\"Enter Watts\",P901=\"\"),P901*N901*(1-X901)/1000,O901*N901(1-X901)/1000)),IF(AND(E901=\"\",L901=\"\"),\"\",0))","v":""},"","","","","",null,null,0,{"$nulls":3},"No"]
[null,883,{"$nulls":5},"",null,"",{"$nulls":4},"",null,"",null,"No",null,"",{"v":0,"d":"0.0000"},"",{"v":0,"d":"0.00"},{"$f":"IF(R902=\"Interior\",IF(AND(L902=\"\",E902=\"\"),\"\",IF(OR(P902>0,O902=\"Enter Watts\",P902=\"\"),P902*N902*(1-X902)/1000,O902*N902(1-X902)/1000)),IF(AND(E902=\"\",L902=\"\"),\"\",0))","v":""},"","","","","",null,null,0,{"$nulls":3},"No"]
[null,884,{"$nulls":5},"",null,"",{"$nulls":4},"",null,"",null,"No",null,"",{"v":0,"d":"0.0000"},"",{"v":0,"d":"0.00"},{"$f":"IF(R903=\"Interior\",IF(AND(L903=\"\",E903=\"\"),\"\",IF(OR(P903>0,O903=\"Enter Watts\",P903=\"\"),P903*N903*(1-X903)/1000,O903*N903(1-X903)/1000)),IF(AND(E903=\"\",L903=\"\"),\"\",0))","v":""},"","","","","",null,null,0,{"$nulls":3},"No"]
[null,885,{"$nulls":5},"",null,"",{"$nulls":4},"",null,"",null,"No",null,"",{"v":0,"d":"0.0000"},"",{"v":0,"d":"0.00"},{"$f":"IF(R904=\"Interior\",IF(AND(L904=\"\",E904=\"\"),\"\",IF(OR(P904>0,O904=\"Enter Watts\",P904=\"\"),P904*N904*(1-X904)/1000,O904*N904(1-X904)/1000)),IF(AND(E904=\"\",L904=\"\"),\"\",0))","v":""},"","","","","",null,null,0,{"$nulls":3},"No"]
[null,886,{"$nulls":5},"",null,"",{"$nulls":4},"",null,"",null,"No",null,"",{"v":0,"d":"0.0000"},"",{"v":0,"d":"0.00"},{"$f":"IF(R905=\"Interior\",IF(AND(L905=\"\",E905=\"\"),\"\",IF(OR(P905>0,O905=\"Enter Watts\",P905=\"\"),P905*N905*(1-X905)/1000,O905*N905(1-X905)/1000)),IF(AND(E905=\"\",L905=\"\"),\"\",0))","v":""},"","","","","",null,null,0,{"$nulls":3},"No"]
[null,887,{"$nulls":5},"",null,"",{"$nulls":4},"",null,"",null,"No",null,"",{"v":0,"d":"0.0000"},"",{"v":0,"d":"0.00"},{"$f":"IF(R906=\"Interior\",IF(AND(L906=\"\",E906=\"\"),\"\",IF(OR(P906>0,O906=\"Enter Watts\",P906=\"\"),P906*N906*(1-X906)/1000,O906*N906(1-X906)/1000)),IF(AND(E906=\"\",L906=\"\"),\"\",0))","v":""},"","","","","",null,null,0,{"$nulls":3},"No"]
[null,888,{"$nulls":5},"",null,"",{"$nulls":4},"",null,"",null,"No",null,"",{"v":0,"d":"0.0000"},"",{"v":0,"d":"0.00"},{"$f":"IF(R907=\"Interior\",IF(AND(L907=\"\",E907=\"\"),\"\",IF(OR(P907>0,O907=\"Enter Watts\",P907=\"\"),P907*N907*(1-X907)/1000,O907*N907(1-X907)/1000)),IF(AND(E907=\"\",L907=\"\"),\"\",0))","v":""},"","","","","",null,null,0,{"$nulls":3},"No"]
[null,889,{"$nulls":5},"",null,"",{"$nulls":4},"",null,"",null,"No",null,"",{"v":0,"d":"0.0000"},"",{"v":0,"d":"0.00"},{"$f":"IF(R908=\"Interior\",IF(AND(L908=\"\",E908=\"\"),\"\",IF(OR(P908>0,O908=\"Enter Watts\",P908=\"\"),P908*N908*(1-X908)/1000,O908*N908(1-X908)/1000)),IF(AND(E908=\"\",L908=\"\"),\"\",0))","v":""},"","","","","",null,null,0,{"$nulls":3},"No"]
[null,890,{"$nulls":5},"",null,"",{"$nulls":4},"",null,"",null,"No",null,"",{"v":0,"d":"0.0000"},"",{"v":0,"d":"0.00"},{"$f":"IF(R909=\"Interior\",IF(AND(L909=\"\",E909=\"\"),\"\",IF(OR(P909>0,O909=\"Enter Watts\",P909=\"\"),P909*N909*(1-X909)/1000,O909*N909(1-X909)/1000)),IF(AND(E909=\"\",L909=\"\"),\"\",0))","v":""},"","","","","",null,null,0,{"$nulls":3},"No"]
[null,891,{"$nulls":5},"",null,"",{"$nulls":4},"",null,"",null,"No",null,"",{"v":0,"d":"0.0000"},"",{"v":0,"d":"0.00"},{"$f":"IF(R910=\"Interior\",IF(AND(L910=\"\",E910=\"\"),\"\",IF(OR(P910>0,O910=\"Enter Watts\",P910=\"\"),P910*N910*(1-X910)/1000,O910*N910(1-X910)/1000)),IF(AND(E910=\"\",L910=\"\"),\"\",0))","v":""},"","","","","",null,null,0,{"$nulls":3},"No",{"$nulls":6},"","",null,""]
[null,892,{"$nulls":5},"",null,"",{"$nulls":4},"",null,"",null,"No",null,"",{"v":0,"d":"0.0000"},"",{"v":0,"d":"0.00"},{"$f":"IF(R911=\"Interior\",IF(AND(L911=\"\",E911=\"\"),\"\",IF(OR(P911>0,O911=\"Enter Watts\",P911=\"\"),P911*N911*(1-X911)/1000,O911*N911(1-X911)/1000)),IF(AND(E911=\"\",L911=\"\"),\"\",0))","v":""},"","","","","",null,null,0,{"$nulls":3},"No"]
[null,893,{"$nulls":5},"",null,"",{"$nulls":4},"",null,"",null,"No",null,"",{"v":0,"d":"0.0000"},"",{"v":0,"d":"0.00"},{"$f":"IF(R912=\"Interior\",IF(AND(L912=\"\",E912=\"\"),\"\",IF(OR(P912>0,O912=\"Enter Watts\",P912=\"\"),P912*N912*(1-X912)/1000,O912*N912(1-X912)/1000)),IF(AND(E912=\"\",L912=\"\"),\"\",0))","v":""},"","","","","",null,null,0,{"$nulls":3},"No"]
[null,894,{"$nulls":5},"",null,"",{"$nulls":4},"",null,"",null,"No",null,"",{"v":0,"d":"0.0000"},"",{"v":0,"d":"0.00"},{"$f":"IF(R913=\"Interior\",IF(AND(L913=\"\",E913=\"\"),\"\",IF(OR(P913>0,O913=\"Enter Watts\",P913=\"\"),P913*N913*(1-X913)/1000,O913*N913(1-X913)/1000)),IF(AND(E913=\"\",L913=\"\"),\"\",0))","v":""},"","","","","",null,null,0,{"$nulls":3},"No"]
[null,895,{"$nulls":5},"",null,"",{"$nulls":4},"",null,"",null,"No",null,"",{"v":0,"d":"0.0000"},"",{"v":0,"d":"0.00"},{"$f":"IF(R914=\"Interior\",IF(AND(L914=\"\",E914=\"\"),\"\",IF(OR(P914>0,O914=\"Enter Watts\",P914=\"\"),P914*N914*(1-X914)/1000,O914*N914(1-X914)/1000)),IF(AND(E914=\"\",L914=\"\"),\"\",0))","v":""},"","","","","",null,null,0,{"$nulls":3},"No"]
[null,896,{"$nulls":5},"",null,"",{"$nulls":4},"",null,"",null,"No",null,"",{"v":0,"d":"0.0000"},"",{"v":0,"d":"0.00"},{"$f":"IF(R915=\"Interior\",IF(AND(L915=\"\",E915=\"\"),\"\",IF(OR(P915>0,O915=\"Enter Watts\",P915=\"\"),P915*N915*(1-X915)/1000,O915*N915(1-X915)/1000)),IF(AND(E915=\"\",L915=\"\"),\"\",0))","v":""},"","","","","",null,null,0,{"$nulls":3},"No"]
[null,897,{"$nulls":5},"",null,{"$f":"IF(AND(E916<>\"\",G916<>\"\",$E$8=\"Default Sector Hours\"),VLOOKUP(IF(R916=\"Exterior\",\"Exterior\",$E$7),$W$1036:$X$1041,2,FALSE),\"\")","v":""},{"$nulls":4},{"$f":"IF(L916=\"\",\"\",VLOOKUP(L916,$AQ$1113:$AR$1541,2,FALSE))","v":""},null,"",null,"No",null,"",{"v":0,"d":"0.0000"},"",{"v":0,"d":"0.00"},{"$f":"IF(R916=\"Interior\",IF(AND(L916=\"\",E916=\"\"),\"\",IF(OR(P916>0,O916=\"Enter Watts\",P916=\"\"),P916*N916*(1-X916)/1000,O916*N916(1-X916)/1000)),IF(AND(E916=\"\",L916=\"\"),\"\",0))","v":""},{"$f":"IFERROR(IF(AND(L916=\"\", E916=\"\"),\"\",N916/1000*IF(OR(P916>0,O916=\"Enter Watts\"),P916,O916)*IF(R916=\"Exterior\",$X$1041,IF($E$8=\"Manual Input\",Q916,VLOOKUP($E$7,$W$1036:$Z$1040,2,FALSE)))*IF(S916=\"Yes\",IF(R916=\"Exterior\",1-$Z$1041,1-VLOOKUP($E$7,$W$1036:$Z$1040,4,FALSE)),1)),0)","v":""},"",{"$f":"IF(AND(U916=\"\",Y916=\"\"),\"\",IF(OR(U916=\"\",Y916=\"\"),0,  IF($E$8=\"Manual Input\",$G$9,   VLOOKUP($E$7,$W$1036:$Z$1041,3,FALSE))     *(U916-Y916)))","v":""},"","",null,null,0,{"$nulls":3},"No",{"$nulls":6},"","",null,""]
[null,898,{"$nulls":5},"",null,"",{"$nulls":4},"",null,"",null,"No",null,{"$f":"IF(V917=\"Int Control\",IF(E917=\"\",\"\",IF(OR(I917>0,H917=\"Enter Watts\"),I917*G917/1000*(1-$E$15),H917*G917/1000*(1-$E$15))),IF(E917=\"\",\"\",IF(OR(I917>0,H917=\"Enter Watts\"),I917*G917/1000,H917*G917/1000)))","v":""},{"$f":"IF(AND(R917=\"Interior\",S917=\"Yes\"),\"Int Control\",0)","v":{"v":0,"d":"0.0000"}},{"$f":"IFERROR(IF(V917=\"Int Control\",IF(E917=\"\",\"\",G917/1000*(1-$E$15)*IF(OR(I917>0,H917=\"Enter Watts\"),I917,H917)*IF(R917=\"Exterior\",$X$1041*(1-$G$15),IF($E$8=\"Manual Input\",J917,VLOOKUP($E$7,$W$1036:$Z$1040,2,FALSE)*(1-$E$15)))),IF(E917=\"\",\"\",G917/1000*IF(OR(I917>0,H917=\"Enter Watts\"),I917,H917)*IF(R917=\"Exterior\",$X$1041,IF($E$8=\"Manual Input\",J917,VLOOKUP($E$7,$W$1036:$Z$1040,2,FALSE))))),\"0\")","v":""},{"$f":"IF(S917=\"No\",0,AA$1036)","v":{"v":0,"d":"0.00"}},{"$f":"IF(R917=\"Interior\",IF(AND(L917=\"\",E917=\"\"),\"\",IF(OR(P917>0,O917=\"Enter Watts\",P917=\"\"),P917*N917*(1-X917)/1000,O917*N917(1-X917)/1000)),IF(AND(E917=\"\",L917=\"\"),\"\",0))","v":""},"","","","","",null,null,{"$f":"AF917*N917","v":0},{"$nulls":3},{"$f":"IF(_xlfn.ISFORMULA(J917)=TRUE,\"No\",\"Yes\")","v":"No"}]
[null,899,{"$nulls":5},"",null,"",{"$nulls":4},"",null,"",null,"No",null,"",{"v":0,"d":"0.0000"},"",{"v":0,"d":"0.00"},{"$f":"IF(R918=\"Interior\",IF(AND(L918=\"\",E918=\"\"),\"\",IF(OR(P918>0,O918=\"Enter Watts\",P918=\"\"),P918*N918*(1-X918)/1000,O918*N918(1-X918)/1000)),IF(AND(E918=\"\",L918=\"\"),\"\",0))","v":""},"","","","","",null,null,0,{"$nulls":3},"No"]
[null,900,{"$nulls":5},"",null,"",{"$nulls":4},"",null,"",null,"No",null,"",{"v":0,"d":"0.0000"},"",{"v":0,"d":"0.00"},{"$f":"IF(R919=\"Interior\",IF(AND(L919=\"\",E919=\"\"),\"\",IF(OR(P919>0,O919=\"Enter Watts\",P919=\"\"),P919*N919*(1-X919)/1000,O919*N919(1-X919)/1000)),IF(AND(E919=\"\",L919=\"\"),\"\",0))","v":""},"","","","","",null,null,0,{"$nulls":3},"No"]
[null,901,{"$nulls":5},"",null,"",{"$nulls":4},"",null,"",null,"No",null,"",{"v":0,"d":"0.0000"},"",{"v":0,"d":"0.00"},{"$f":"IF(R920=\"Interior\",IF(AND(L920=\"\",E920=\"\"),\"\",IF(OR(P920>0,O920=\"Enter Watts\",P920=\"\"),P920*N920*(1-X920)/1000,O920*N920(1-X920)/1000)),IF(AND(E920=\"\",L920=\"\"),\"\",0))","v":""},"","","","","",null,null,0,{"$nulls":3},"No"]
[null,902,{"$nulls":5},"",null,"",{"$nulls":4},"",null,"",null,"No",null,"",{"v":0,"d":"0.0000"},"",{"v":0,"d":"0.00"},{"$f":"IF(R921=\"Interior\",IF(AND(L921=\"\",E921=\"\"),\"\",IF(OR(P921>0,O921=\"Enter Watts\",P921=\"\"),P921*N921*(1-X921)/1000,O921*N921(1-X921)/1000)),IF(AND(E921=\"\",L921=\"\"),\"\",0))","v":""},"","","","","",null,null,0,{"$nulls":3},"No"]
[null,903,{"$nulls":5},"",null,"",{"$nulls":4},"",null,"",null,"No",null,"",{"v":0,"d":"0.0000"},"",{"v":0,"d":"0.00"},{"$f":"IF(R922=\"Interior\",IF(AND(L922=\"\",E922=\"\"),\"\",IF(OR(P922>0,O922=\"Enter Watts\",P922=\"\"),P922*N922*(1-X922)/1000,O922*N922(1-X922)/1000)),IF(AND(E922=\"\",L922=\"\"),\"\",0))","v":""},"","","","","",null,null,0,{"$nulls":3},"No"]
[null,904,{"$nulls":5},"",null,"",{"$nulls":4},"",null,"",null,"No",null,"",{"v":0,"d":"0.0000"},"",{"v":0,"d":"0.00"},{"$f":"IF(R923=\"Interior\",IF(AND(L923=\"\",E923=\"\"),\"\",IF(OR(P923>0,O923=\"Enter Watts\",P923=\"\"),P923*N923*(1-X923)/1000,O923*N923(1-X923)/1000)),IF(AND(E923=\"\",L923=\"\"),\"\",0))","v":""},"",{"$f":"IFERROR(IF(OR(I923>0,H923=\"Enter Watts\"),I923*G923,H923*G923)-IF(OR(P923>0,O923=\"Enter Watts\"),P923*N923,O923*N923),\"\")","v":""},"",{"$f":"IF(AND(W923=\"\",Z923=\"\"),\"\",IF(OR(W923=\"\",Z923=\"\"),0,W923-Z923))","v":""},"",null,null,0,{"$nulls":3},"No"]
[null,905,{"$nulls":5},"",null,"",{"$nulls":4},"",null,"",null,"No",null,"",{"v":0,"d":"0.0000"},"",{"v":0,"d":"0.00"},{"$f":"IF(R924=\"Interior\",IF(AND(L924=\"\",E924=\"\"),\"\",IF(OR(P924>0,O924=\"Enter Watts\",P924=\"\"),P924*N924*(1-X924)/1000,O924*N924(1-X924)/1000)),IF(AND(E924=\"\",L924=\"\"),\"\",0))","v":""},"",{"$f":"IFERROR(IF(OR(I924>0,H924=\"Enter Watts\"),I924*G924,H924*G924)-IF(OR(P924>0,O924=\"Enter Watts\"),P924*N924,O924*N924),\"\")","v":""},"",{"$f":"IF(AND(W924=\"\",Z924=\"\"),\"\",IF(OR(W924=\"\",Z924=\"\"),0,W924-Z924))","v":""},"",null,null,0,{"$nulls":3},"No"]
[null,906,{"$nulls":5},"",null,"",{"$nulls":4},"",null,"",null,"No",null,"",{"v":0,"d":"0.0000"},"",{"v":0,"d":"0.00"},{"$f":"IF(R925=\"Interior\",IF(AND(L925=\"\",E925=\"\"),\"\",IF(OR(P925>0,O925=\"Enter Watts\",P925=\"\"),P925*N925*(1-X925)/1000,O925*N925(1-X925)/1000)),IF(AND(E925=\"\",L925=\"\"),\"\",0))","v":""},"","","","","",null,null,0,{"$nulls":3},"No"]
[null,907,{"$nulls":5},"",null,"",{"$nulls":4},"",null,"",null,"No",null,"",{"v":0,"d":"0.0000"},"",{"v":0,"d":"0.00"},{"$f":"IF(R926=\"Interior\",IF(AND(L926=\"\",E926=\"\"),\"\",IF(OR(P926>0,O926=\"Enter Watts\",P926=\"\"),P926*N926*(1-X926)/1000,O926*N926(1-X926)/1000)),IF(AND(E926=\"\",L926=\"\"),\"\",0))","v":""},"","","","","",null,null,0,{"$nulls":3},"No"]
[null,908,{"$nulls":5},"",null,"",{"$nulls":4},"",null,"",null,"No",null,"",{"v":0,"d":"0.0000"},"",{"v":0,"d":"0.00"},{"$f":"IF(R927=\"Interior\",IF(AND(L927=\"\",E927=\"\"),\"\",IF(OR(P927>0,O927=\"Enter Watts\",P927=\"\"),P927*N927*(1-X927)/1000,O927*N927(1-X927)/1000)),IF(AND(E927=\"\",L927=\"\"),\"\",0))","v":""},"","","","","",null,null,0,{"$nulls":3},"No",{"$nulls":6},"","",null,""]
[null,909,{"$nulls":5},"",null,"",{"$nulls":4},"",null,"",null,"No",null,"",{"v":0,"d":"0.0000"},"",{"v":0,"d":"0.00"},{"$f":"IF(R928=\"Interior\",IF(AND(L928=\"\",E928=\"\"),\"\",IF(OR(P928>0,O928=\"Enter Watts\",P928=\"\"),P928*N928*(1-X928)/1000,O928*N928(1-X928)/1000)),IF(AND(E928=\"\",L928=\"\"),\"\",0))","v":""},"","","","","",null,null,0,{"$nulls":3},"No"]
[null,910,{"$nulls":5},"",null,"",{"$nulls":4},"",null,"",null,"No",null,"",{"v":0,"d":"0.0000"},"",{"v":0,"d":"0.00"},{"$f":"IF(R929=\"Interior\",IF(AND(L929=\"\",E929=\"\"),\"\",IF(OR(P929>0,O929=\"Enter Watts\",P929=\"\"),P929*N929*(1-X929)/1000,O929*N929(1-X929)/1000)),IF(AND(E929=\"\",L929=\"\"),\"\",0))","v":""},"","","","","",null,null,0,{"$nulls":3},"No"]
[null,911,{"$nulls":5},"",null,"",{"$nulls":4},"",null,"",null,"No",null,"",{"v":0,"d":"0.0000"},"",{"v":0,"d":"0.00"},{"$f":"IF(R930=\"Interior\",IF(AND(L930=\"\",E930=\"\"),\"\",IF(OR(P930>0,O930=\"Enter Watts\",P930=\"\"),P930*N930*(1-X930)/1000,O930*N930(1-X930)/1000)),IF(AND(E930=\"\",L930=\"\"),\"\",0))","v":""},"","","","","",null,null,0,{"$nulls":3},"No"]
[null,912,{"$nulls":5},"",null,"",{"$nulls":4},"",null,"",null,"No",null,"",{"v":0,"d":"0.0000"},"",{"v":0,"d":"0.00"},{"$f":"IF(R931=\"Interior\",IF(AND(L931=\"\",E931=\"\"),\"\",IF(OR(P931>0,O931=\"Enter Watts\",P931=\"\"),P931*N931*(1-X931)/1000,O931*N931(1-X931)/1000)),IF(AND(E931=\"\",L931=\"\"),\"\",0))","v":""},"","","","","",null,null,0,{"$nulls":3},"No"]
[null,913,{"$nulls":5},"",null,"",{"$nulls":4},"",null,"",null,"No",null,"",{"v":0,"d":"0.0000"},"",{"v":0,"d":"0.00"},{"$f":"IF(R932=\"Interior\",IF(AND(L932=\"\",E932=\"\"),\"\",IF(OR(P932>0,O932=\"Enter Watts\",P932=\"\"),P932*N932*(1-X932)/1000,O932*N932(1-X932)/1000)),IF(AND(E932=\"\",L932=\"\"),\"\",0))","v":""},"","","","","",null,null,0,{"$nulls":3},"No"]
[null,914,{"$nulls":5},"",null,"",{"$nulls":4},"",null,"",null,"No",null,"",{"v":0,"d":"0.0000"},"",{"v":0,"d":"0.00"},{"$f":"IF(R933=\"Interior\",IF(AND(L933=\"\",E933=\"\"),\"\",IF(OR(P933>0,O933=\"Enter Watts\",P933=\"\"),P933*N933*(1-X933)/1000,O933*N933(1-X933)/1000)),IF(AND(E933=\"\",L933=\"\"),\"\",0))","v":""},"","","","","",null,null,0,{"$nulls":3},"No",{"$nulls":6},"","",null,""]
[null,915,{"$nulls":5},"",null,"",{"$nulls":4},"",null,"",null,"No",null,"",{"v":0,"d":"0.0000"},"",{"v":0,"d":"0.00"},{"$f":"IF(R934=\"Interior\",IF(AND(L934=\"\",E934=\"\"),\"\",IF(OR(P934>0,O934=\"Enter Watts\",P934=\"\"),P934*N934*(1-X934)/1000,O934*N934(1-X934)/1000)),IF(AND(E934=\"\",L934=\"\"),\"\",0))","v":""},"","","","","",null,null,0,{"$nulls":3},"No"]
[null,916,{"$nulls":5},"",null,"",{"$nulls":4},"",null,"",null,"No",null,"",{"v":0,"d":"0.0000"},"",{"v":0,"d":"0.00"},{"$f":"IF(R935=\"Interior\",IF(AND(L935=\"\",E935=\"\"),\"\",IF(OR(P935>0,O935=\"Enter Watts\",P935=\"\"),P935*N935*(1-X935)/1000,O935*N935(1-X935)/1000)),IF(AND(E935=\"\",L935=\"\"),\"\",0))","v":""},"","","","","",null,null,0,{"$nulls":3},"No"]
[null,917,{"$nulls":5},"",null,"",{"$nulls":4},"",null,"",null,"No",null,"",{"v":0,"d":"0.0000"},"",{"v":0,"d":"0.00"},{"$f":"IF(R936=\"Interior\",IF(AND(L936=\"\",E936=\"\"),\"\",IF(OR(P936>0,O936=\"Enter Watts\",P936=\"\"),P936*N936*(1-X936)/1000,O936*N936(1-X936)/1000)),IF(AND(E936=\"\",L936=\"\"),\"\",0))","v":""},"","","","","",null,null,0,{"$nulls":3},"No"]
[null,918,{"$nulls":5},"",null,"",{"$nulls":4},"",null,"",null,"No",null,"",{"v":0,"d":"0.0000"},"",{"v":0,"d":"0.00"},{"$f":"IF(R937=\"Interior\",IF(AND(L937=\"\",E937=\"\"),\"\",IF(OR(P937>0,O937=\"Enter Watts\",P937=\"\"),P937*N937*(1-X937)/1000,O937*N937(1-X937)/1000)),IF(AND(E937=\"\",L937=\"\"),\"\",0))","v":""},"","","","","",null,null,0,{"$nulls":3},"No"]
[null,919,{"$nulls":5},"",null,"",{"$nulls":4},"",null,"",null,"No",null,"",{"v":0,"d":"0.0000"},"",{"v":0,"d":"0.00"},{"$f":"IF(R938=\"Interior\",IF(AND(L938=\"\",E938=\"\"),\"\",IF(OR(P938>0,O938=\"Enter Watts\",P938=\"\"),P938*N938*(1-X938)/1000,O938*N938(1-X938)/1000)),IF(AND(E938=\"\",L938=\"\"),\"\",0))","v":""},"","","","","",null,null,0,{"$nulls":3},"No"]
[null,920,{"$nulls":5},"",null,"",{"$nulls":4},"",null,"",null,"No",null,"",{"v":0,"d":"0.0000"},"",{"v":0,"d":"0.00"},{"$f":"IF(R939=\"Interior\",IF(AND(L939=\"\",E939=\"\"),\"\",IF(OR(P939>0,O939=\"Enter Watts\",P939=\"\"),P939*N939*(1-X939)/1000,O939*N939(1-X939)/1000)),IF(AND(E939=\"\",L939=\"\"),\"\",0))","v":""},"","","","","",null,null,0,{"$nulls":3},"No"]
[null,921,{"$nulls":5},"",null,"",{"$nulls":4},"",null,"",null,"No",null,"",{"v":0,"d":"0.0000"},"",{"v":0,"d":"0.00"},{"$f":"IF(R940=\"Interior\",IF(AND(L940=\"\",E940=\"\"),\"\",IF(OR(P940>0,O940=\"Enter Watts\",P940=\"\"),P940*N940*(1-X940)/1000,O940*N940(1-X940)/1000)),IF(AND(E940=\"\",L940=\"\"),\"\",0))","v":""},"","","","","",null,null,0,{"$nulls":3},"No",{"$nulls":6},"","",null,""]
[null,922,{"$nulls":5},"",null,"",{"$nulls":4},"",null,"",null,"No",null,"",{"v":0,"d":"0.0000"},"",{"v":0,"d":"0.00"},{"$f":"IF(R941=\"Interior\",IF(AND(L941=\"\",E941=\"\"),\"\",IF(OR(P941>0,O941=\"Enter Watts\",P941=\"\"),P941*N941*(1-X941)/1000,O941*N941(1-X941)/1000)),IF(AND(E941=\"\",L941=\"\"),\"\",0))","v":""},"","","","","",null,null,0,{"$nulls":3},"No"]
[null,923,{"$nulls":5},"",null,"",{"$nulls":4},"",null,"",null,"No",null,"",{"v":0,"d":"0.0000"},"",{"v":0,"d":"0.00"},{"$f":"IF(R942=\"Interior\",IF(AND(L942=\"\",E942=\"\"),\"\",IF(OR(P942>0,O942=\"Enter Watts\",P942=\"\"),P942*N942*(1-X942)/1000,O942*N942(1-X942)/1000)),IF(AND(E942=\"\",L942=\"\"),\"\",0))","v":""},"","","","","",null,null,0,{"$nulls":3},"No"]
[null,924,{"$nulls":5},"",null,"",{"$nulls":4},"",null,"",null,"No",null,"",{"v":0,"d":"0.0000"},"",{"v":0,"d":"0.00"},{"$f":"IF(R943=\"Interior\",IF(AND(L943=\"\",E943=\"\"),\"\",IF(OR(P943>0,O943=\"Enter Watts\",P943=\"\"),P943*N943*(1-X943)/1000,O943*N943(1-X943)/1000)),IF(AND(E943=\"\",L943=\"\"),\"\",0))","v":""},"","","","","",null,null,0,{"$nulls":3},"No"]
[null,925,{"$nulls":5},"",null,"",{"$nulls":4},"",null,"",null,"No",null,"",{"v":0,"d":"0.0000"},"",{"v":0,"d":"0.00"},{"$f":"IF(R944=\"Interior\",IF(AND(L944=\"\",E944=\"\"),\"\",IF(OR(P944>0,O944=\"Enter Watts\",P944=\"\"),P944*N944*(1-X944)/1000,O944*N944(1-X944)/1000)),IF(AND(E944=\"\",L944=\"\"),\"\",0))","v":""},"","","","","",null,null,0,{"$nulls":3},"No"]
[null,926,{"$nulls":5},"",null,"",{"$nulls":4},"",null,"",null,"No",null,"",{"v":0,"d":"0.0000"},"",{"v":0,"d":"0.00"},{"$f":"IF(R945=\"Interior\",IF(AND(L945=\"\",E945=\"\"),\"\",IF(OR(P945>0,O945=\"Enter Watts\",P945=\"\"),P945*N945*(1-X945)/1000,O945*N945(1-X945)/1000)),IF(AND(E945=\"\",L945=\"\"),\"\",0))","v":""},"","","","","",null,null,0,{"$nulls":3},"No"]
[null,927,{"$nulls":5},"",null,"",{"$nulls":4},"",null,"",null,"No",null,"",{"v":0,"d":"0.0000"},"",{"v":0,"d":"0.00"},{"$f":"IF(R946=\"Interior\",IF(AND(L946=\"\",E946=\"\"),\"\",IF(OR(P946>0,O946=\"Enter Watts\",P946=\"\"),P946*N946*(1-X946)/1000,O946*N946(1-X946)/1000)),IF(AND(E946=\"\",L946=\"\"),\"\",0))","v":""},"","","","","",null,null,0,{"$nulls":3},"No",{"$nulls":6},"","",null,""]
[null,928,{"$nulls":5},"",null,"",{"$nulls":4},"",null,"",null,"No",null,"",{"v":0,"d":"0.0000"},"",{"v":0,"d":"0.00"},{"$f":"IF(R947=\"Interior\",IF(AND(L947=\"\",E947=\"\"),\"\",IF(OR(P947>0,O947=\"Enter Watts\",P947=\"\"),P947*N947*(1-X947)/1000,O947*N947(1-X947)/1000)),IF(AND(E947=\"\",L947=\"\"),\"\",0))","v":""},"","","","","",null,null,0,{"$nulls":3},"No"]
[null,929,{"$nulls":5},"",null,"",{"$nulls":4},"",null,"",null,"No",null,"",{"v":0,"d":"0.0000"},"",{"v":0,"d":"0.00"},{"$f":"IF(R948=\"Interior\",IF(AND(L948=\"\",E948=\"\"),\"\",IF(OR(P948>0,O948=\"Enter Watts\",P948=\"\"),P948*N948*(1-X948)/1000,O948*N948(1-X948)/1000)),IF(AND(E948=\"\",L948=\"\"),\"\",0))","v":""},"","","","","",null,null,0,{"$nulls":3},"No"]
[null,930,{"$nulls":5},"",null,"",{"$nulls":4},"",null,"",null,"No",null,"",{"v":0,"d":"0.0000"},"",{"v":0,"d":"0.00"},{"$f":"IF(R949=\"Interior\",IF(AND(L949=\"\",E949=\"\"),\"\",IF(OR(P949>0,O949=\"Enter Watts\",P949=\"\"),P949*N949*(1-X949)/1000,O949*N949(1-X949)/1000)),IF(AND(E949=\"\",L949=\"\"),\"\",0))","v":""},"","","","","",null,null,0,{"$nulls":3},"No"]
[null,931,{"$nulls":5},"",null,"",{"$nulls":4},"",null,"",null,"No",null,"",{"v":0,"d":"0.0000"},"",{"v":0,"d":"0.00"},{"$f":"IF(R950=\"Interior\",IF(AND(L950=\"\",E950=\"\"),\"\",IF(OR(P950>0,O950=\"Enter Watts\",P950=\"\"),P950*N950*(1-X950)/1000,O950*N950(1-X950)/1000)),IF(AND(E950=\"\",L950=\"\"),\"\",0))","v":""},"","","","","",null,null,0,{"$nulls":3},"No"]
[null,932,{"$nulls":5},"",null,"",{"$nulls":4},"",null,"",null,"No",null,"",{"v":0,"d":"0.0000"},"",{"v":0,"d":"0.00"},{"$f":"IF(R951=\"Interior\",IF(AND(L951=\"\",E951=\"\"),\"\",IF(OR(P951>0,O951=\"Enter Watts\",P951=\"\"),P951*N951*(1-X951)/1000,O951*N951(1-X951)/1000)),IF(AND(E951=\"\",L951=\"\"),\"\",0))","v":""},"","","","","",null,null,0,{"$nulls":3},"No"]
[null,933,{"$nulls":5},"",null,"",{"$nulls":4},"",null,"",null,"No",null,"",{"v":0,"d":"0.0000"},"",{"v":0,"d":"0.00"},{"$f":"IF(R952=\"Interior\",IF(AND(L952=\"\",E952=\"\"),\"\",IF(OR(P952>0,O952=\"Enter Watts\",P952=\"\"),P952*N952*(1-X952)/1000,O952*N952(1-X952)/1000)),IF(AND(E952=\"\",L952=\"\"),\"\",0))","v":""},"","","","","",null,null,0,{"$nulls":3},"No"]
[null,934,{"$nulls":5},"",null,"",{"$nulls":4},"",null,"",null,"No",null,"",{"v":0,"d":"0.0000"},"",{"v":0,"d":"0.00"},{"$f":"IF(R953=\"Interior\",IF(AND(L953=\"\",E953=\"\"),\"\",IF(OR(P953>0,O953=\"Enter Watts\",P953=\"\"),P953*N953*(1-X953)/1000,O953*N953(1-X953)/1000)),IF(AND(E953=\"\",L953=\"\"),\"\",0))","v":""},"","","","","",null,null,0,{"$nulls":3},"No"]
[null,935,{"$nulls":5},"",null,"",{"$nulls":4},"",null,"",null,"No",null,"",{"v":0,"d":"0.0000"},"",{"v":0,"d":"0.00"},{"$f":"IF(R954=\"Interior\",IF(AND(L954=\"\",E954=\"\"),\"\",IF(OR(P954>0,O954=\"Enter Watts\",P954=\"\"),P954*N954*(1-X954)/1000,O954*N954(1-X954)/1000)),IF(AND(E954=\"\",L954=\"\"),\"\",0))","v":""},"","","","","",null,null,0,{"$nulls":3},"No"]
[null,936,{"$nulls":5},"",null,"",{"$nulls":4},"",null,"",null,"No",null,"",{"v":0,"d":"0.0000"},"",{"v":0,"d":"0.00"},{"$f":"IF(R955=\"Interior\",IF(AND(L955=\"\",E955=\"\"),\"\",IF(OR(P955>0,O955=\"Enter Watts\",P955=\"\"),P955*N955*(1-X955)/1000,O955*N955(1-X955)/1000)),IF(AND(E955=\"\",L955=\"\"),\"\",0))","v":""},"","","","","",null,null,0,{"$nulls":3},"No"]
[null,937,{"$nulls":5},"",null,"",{"$nulls":4},"",null,"",null,"No",null,"",{"v":0,"d":"0.0000"},"",{"v":0,"d":"0.00"},{"$f":"IF(R956=\"Interior\",IF(AND(L956=\"\",E956=\"\"),\"\",IF(OR(P956>0,O956=\"Enter Watts\",P956=\"\"),P956*N956*(1-X956)/1000,O956*N956(1-X956)/1000)),IF(AND(E956=\"\",L956=\"\"),\"\",0))","v":""},"","","","","",null,null,0,{"$nulls":3},"No"]
[null,938,{"$nulls":5},"",null,"",{"$nulls":4},"",null,"",null,"No",null,"",{"v":0,"d":"0.0000"},"",{"v":0,"d":"0.00"},{"$f":"IF(R957=\"Interior\",IF(AND(L957=\"\",E957=\"\"),\"\",IF(OR(P957>0,O957=\"Enter Watts\",P957=\"\"),P957*N957*(1-X957)/1000,O957*N957(1-X957)/1000)),IF(AND(E957=\"\",L957=\"\"),\"\",0))","v":""},"","","","","",null,null,0,{"$nulls":3},"No"]
[null,939,{"$nulls":5},"",null,"",{"$nulls":4},"",null,"",null,"No",null,"",{"v":0,"d":"0.0000"},"",{"v":0,"d":"0.00"},{"$f":"IF(R958=\"Interior\",IF(AND(L958=\"\",E958=\"\"),\"\",IF(OR(P958>0,O958=\"Enter Watts\",P958=\"\"),P958*N958*(1-X958)/1000,O958*N958(1-X958)/1000)),IF(AND(E958=\"\",L958=\"\"),\"\",0))","v":""},"","","","","",null,null,0,{"$nulls":3},"No",{"$nulls":6},"","",null,""]
[null,940,{"$nulls":5},"",null,"",{"$nulls":4},"",null,"",null,"No",null,"",{"v":0,"d":"0.0000"},"",{"v":0,"d":"0.00"},{"$f":"IF(R959=\"Interior\",IF(AND(L959=\"\",E959=\"\"),\"\",IF(OR(P959>0,O959=\"Enter Watts\",P959=\"\"),P959*N959*(1-X959)/1000,O959*N959(1-X959)/1000)),IF(AND(E959=\"\",L959=\"\"),\"\",0))","v":""},"","","","","",null,null,0,{"$nulls":3},"No"]
[null,941,{"$nulls":5},"",null,"",{"$nulls":4},"",null,"",null,"No",null,"",{"v":0,"d":"0.0000"},"",{"v":0,"d":"0.00"},{"$f":"IF(R960=\"Interior\",IF(AND(L960=\"\",E960=\"\"),\"\",IF(OR(P960>0,O960=\"Enter Watts\",P960=\"\"),P960*N960*(1-X960)/1000,O960*N960(1-X960)/1000)),IF(AND(E960=\"\",L960=\"\"),\"\",0))","v":""},"","","","","",null,null,0,{"$nulls":3},"No"]
[null,942,{"$nulls":5},{"$f":"IF(E961=\"\",\"\",VLOOKUP(E961,$AQ$1114:$AR$1541,2,FALSE))","v":""},null,"",{"$nulls":4},"",null,"",null,"No",null,"",{"v":0,"d":"0.0000"},"",{"v":0,"d":"0.00"},{"$f":"IF(R961=\"Interior\",IF(AND(L961=\"\",E961=\"\"),\"\",IF(OR(P961>0,O961=\"Enter Watts\",P961=\"\"),P961*N961*(1-X961)/1000,O961*N961(1-X961)/1000)),IF(AND(E961=\"\",L961=\"\"),\"\",0))","v":""},"","","","",{"$f":"IF(AC961=\"\",\"\",IF(AND(R961=\"Interior\",S961=\"No\",OR(T961=\"\",T961=\"No\")),$J$1027,IF(AND(R961=\"Interior\",S961=\"Yes\"),$J$1028,IF(AND(R961=\"Exterior\",S961=\"Yes\"),$J$1029,IF(AND(R961=\"Exterior\",S961=\"No\",N961<>G961),\"DNQ\",\"See Lighting Catalog to determine Code\")))))","v":""},null,null,0,{"$nulls":3},"No"]
[null,943,{"$nulls":5},"",null,"",{"$nulls":4},"",null,"",null,"No",null,"",{"v":0,"d":"0.0000"},"",{"v":0,"d":"0.00"},{"$f":"IF(R962=\"Interior\",IF(AND(L962=\"\",E962=\"\"),\"\",IF(OR(P962>0,O962=\"Enter Watts\",P962=\"\"),P962*N962*(1-X962)/1000,O962*N962(1-X962)/1000)),IF(AND(E962=\"\",L962=\"\"),\"\",0))","v":""},"","","","","",null,null,0,{"$nulls":3},"No"]
[null,944,{"$nulls":5},"",null,"",{"$nulls":4},"",null,"",null,"No",null,"",{"v":0,"d":"0.0000"},"",{"v":0,"d":"0.00"},{"$f":"IF(R963=\"Interior\",IF(AND(L963=\"\",E963=\"\"),\"\",IF(OR(P963>0,O963=\"Enter Watts\",P963=\"\"),P963*N963*(1-X963)/1000,O963*N963(1-X963)/1000)),IF(AND(E963=\"\",L963=\"\"),\"\",0))","v":""},"","","","","",null,null,0,{"$nulls":3},"No"]
[null,945,{"$nulls":5},"",null,"",{"$nulls":4},"",null,"",null,"No",null,"",{"v":0,"d":"0.0000"},"",{"v":0,"d":"0.00"},{"$f":"IF(R964=\"Interior\",IF(AND(L964=\"\",E964=\"\"),\"\",IF(OR(P964>0,O964=\"Enter Watts\",P964=\"\"),P964*N964*(1-X964)/1000,O964*N964(1-X964)/1000)),IF(AND(E964=\"\",L964=\"\"),\"\",0))","v":""},"","","","","",null,null,0,{"$nulls":3},"No",{"$nulls":6},"","",null,""]
[null,946,{"$nulls":5},"",null,"",{"$nulls":4},"",null,"",null,"No",null,"",{"v":0,"d":"0.0000"},"",{"v":0,"d":"0.00"},{"$f":"IF(R965=\"Interior\",IF(AND(L965=\"\",E965=\"\"),\"\",IF(OR(P965>0,O965=\"Enter Watts\",P965=\"\"),P965*N965*(1-X965)/1000,O965*N965(1-X965)/1000)),IF(AND(E965=\"\",L965=\"\"),\"\",0))","v":""},"","","","","",null,null,0,{"$nulls":3},"No"]
[null,947,{"$nulls":5},"",null,"",{"$nulls":4},"",null,"",null,"No",null,"",{"v":0,"d":"0.0000"},"",{"v":0,"d":"0.00"},{"$f":"IF(R966=\"Interior\",IF(AND(L966=\"\",E966=\"\"),\"\",IF(OR(P966>0,O966=\"Enter Watts\",P966=\"\"),P966*N966*(1-X966)/1000,O966*N966(1-X966)/1000)),IF(AND(E966=\"\",L966=\"\"),\"\",0))","v":""},"","","","","",null,null,0,{"$nulls":3},"No"]
[null,948,{"$nulls":5},"",null,"",{"$nulls":4},"",null,"",null,"No",null,"",{"v":0,"d":"0.0000"},"",{"v":0,"d":"0.00"},{"$f":"IF(R967=\"Interior\",IF(AND(L967=\"\",E967=\"\"),\"\",IF(OR(P967>0,O967=\"Enter Watts\",P967=\"\"),P967*N967*(1-X967)/1000,O967*N967(1-X967)/1000)),IF(AND(E967=\"\",L967=\"\"),\"\",0))","v":""},"","","","","",null,null,0,{"$nulls":3},"No"]
[null,949,{"$nulls":5},"",null,"",{"$nulls":4},"",null,"",null,"No",null,"",{"v":0,"d":"0.0000"},"",{"v":0,"d":"0.00"},{"$f":"IF(R968=\"Interior\",IF(AND(L968=\"\",E968=\"\"),\"\",IF(OR(P968>0,O968=\"Enter Watts\",P968=\"\"),P968*N968*(1-X968)/1000,O968*N968(1-X968)/1000)),IF(AND(E968=\"\",L968=\"\"),\"\",0))","v":""},"","","","","",null,null,0,{"$nulls":3},"No"]
[null,950,{"$nulls":5},"",null,"",{"$nulls":4},"",null,"",null,"No",null,"",{"v":0,"d":"0.0000"},"",{"v":0,"d":"0.00"},{"$f":"IF(R969=\"Interior\",IF(AND(L969=\"\",E969=\"\"),\"\",IF(OR(P969>0,O969=\"Enter Watts\",P969=\"\"),P969*N969*(1-X969)/1000,O969*N969(1-X969)/1000)),IF(AND(E969=\"\",L969=\"\"),\"\",0))","v":""},"","","","","",null,null,0,{"$nulls":3},"No"]
[null,951,{"$nulls":5},"",null,"",{"$nulls":4},"",null,"",null,"No",null,"",{"v":0,"d":"0.0000"},"",{"v":0,"d":"0.00"},{"$f":"IF(R970=\"Interior\",IF(AND(L970=\"\",E970=\"\"),\"\",IF(OR(P970>0,O970=\"Enter Watts\",P970=\"\"),P970*N970*(1-X970)/1000,O970*N970(1-X970)/1000)),IF(AND(E970=\"\",L970=\"\"),\"\",0))","v":""},"","","","","",null,null,0,{"$nulls":3},"No"]
[null,952,{"$nulls":5},"",null,"",{"$nulls":4},"",null,"",null,"No",null,"",{"v":0,"d":"0.0000"},"",{"v":0,"d":"0.00"},{"$f":"IF(R971=\"Interior\",IF(AND(L971=\"\",E971=\"\"),\"\",IF(OR(P971>0,O971=\"Enter Watts\",P971=\"\"),P971*N971*(1-X971)/1000,O971*N971(1-X971)/1000)),IF(AND(E971=\"\",L971=\"\"),\"\",0))","v":""},"",{"$f":"IFERROR(IF(OR(I971>0,H971=\"Enter Watts\"),I971*G971,H971*G971)-IF(OR(P971>0,O971=\"Enter Watts\"),P971*N971,O971*N971),\"\")","v":""},"",{"$f":"IF(AND(W971=\"\",Z971=\"\"),\"\",IF(OR(W971=\"\",Z971=\"\"),0,W971-Z971))","v":""},"",null,null,0,{"$nulls":3},"No"]
[null,953,{"$nulls":5},"",null,"",{"$nulls":4},"",null,"",null,"No",null,"",{"v":0,"d":"0.0000"},"",{"v":0,"d":"0.00"},{"$f":"IF(R972=\"Interior\",IF(AND(L972=\"\",E972=\"\"),\"\",IF(OR(P972>0,O972=\"Enter Watts\",P972=\"\"),P972*N972*(1-X972)/1000,O972*N972(1-X972)/1000)),IF(AND(E972=\"\",L972=\"\"),\"\",0))","v":""},"",{"$f":"IFERROR(IF(OR(I972>0,H972=\"Enter Watts\"),I972*G972,H972*G972)-IF(OR(P972>0,O972=\"Enter Watts\"),P972*N972,O972*N972),\"\")","v":""},"",{"$f":"IF(AND(W972=\"\",Z972=\"\"),\"\",IF(OR(W972=\"\",Z972=\"\"),0,W972-Z972))","v":""},"",null,null,0,{"$nulls":3},"No"]
[null,954,{"$nulls":5},"",null,"",{"$nulls":4},"",null,"",null,"No",null,"",{"v":0,"d":"0.0000"},"",{"v":0,"d":"0.00"},{"$f":"IF(R973=\"Interior\",IF(AND(L973=\"\",E973=\"\"),\"\",IF(OR(P973>0,O973=\"Enter Watts\",P973=\"\"),P973*N973*(1-X973)/1000,O973*N973(1-X973)/1000)),IF(AND(E973=\"\",L973=\"\"),\"\",0))","v":""},"","","","","",null,null,0,{"$nulls":3},"No"]
[null,955,{"$nulls":5},"",null,"",{"$nulls":4},"",null,"",null,"No",null,"",{"v":0,"d":"0.0000"},"",{"v":0,"d":"0.00"},{"$f":"IF(R974=\"Interior\",IF(AND(L974=\"\",E974=\"\"),\"\",IF(OR(P974>0,O974=\"Enter Watts\",P974=\"\"),P974*N974*(1-X974)/1000,O974*N974(1-X974)/1000)),IF(AND(E974=\"\",L974=\"\"),\"\",0))","v":""},"","","","","",null,null,0,{"$nulls":3},"No"]
[null,956,{"$nulls":5},"",null,"",{"$nulls":4},"",null,"",null,"No",null,"",{"v":0,"d":"0.0000"},"",{"v":0,"d":"0.00"},{"$f":"IF(R975=\"Interior\",IF(AND(L975=\"\",E975=\"\"),\"\",IF(OR(P975>0,O975=\"Enter Watts\",P975=\"\"),P975*N975*(1-X975)/1000,O975*N975(1-X975)/1000)),IF(AND(E975=\"\",L975=\"\"),\"\",0))","v":""},"","","","","",null,null,0,{"$nulls":3},"No",{"$nulls":6},"","",null,""]
[null,957,{"$nulls":5},"",null,"",{"$nulls":4},"",null,"",null,"No",null,"",{"v":0,"d":"0.0000"},"",{"v":0,"d":"0.00"},{"$f":"IF(R976=\"Interior\",IF(AND(L976=\"\",E976=\"\"),\"\",IF(OR(P976>0,O976=\"Enter Watts\",P976=\"\"),P976*N976*(1-X976)/1000,O976*N976(1-X976)/1000)),IF(AND(E976=\"\",L976=\"\"),\"\",0))","v":""},"","","","","",null,null,0,{"$nulls":3},"No"]
[null,958,{"$nulls":5},"",null,"",{"$nulls":4},"",null,"",null,"No",null,"",{"v":0,"d":"0.0000"},"",{"v":0,"d":"0.00"},{"$f":"IF(R977=\"Interior\",IF(AND(L977=\"\",E977=\"\"),\"\",IF(OR(P977>0,O977=\"Enter Watts\",P977=\"\"),P977*N977*(1-X977)/1000,O977*N977(1-X977)/1000)),IF(AND(E977=\"\",L977=\"\"),\"\",0))","v":""},"","","","","",null,null,0,{"$nulls":3},"No"]
[null,959,{"$nulls":5},"",null,"",{"$nulls":4},"",null,"",null,"No",null,"",{"v":0,"d":"0.0000"},"",{"v":0,"d":"0.00"},{"$f":"IF(R978=\"Interior\",IF(AND(L978=\"\",E978=\"\"),\"\",IF(OR(P978>0,O978=\"Enter Watts\",P978=\"\"),P978*N978*(1-X978)/1000,O978*N978(1-X978)/1000)),IF(AND(E978=\"\",L978=\"\"),\"\",0))","v":""},"","","","","",null,null,0,{"$nulls":3},"No"]
[null,960,{"$nulls":5},"",null,"",{"$nulls":4},"",null,"",null,"No",null,"",{"v":0,"d":"0.0000"},"",{"v":0,"d":"0.00"},{"$f":"IF(R979=\"Interior\",IF(AND(L979=\"\",E979=\"\"),\"\",IF(OR(P979>0,O979=\"Enter Watts\",P979=\"\"),P979*N979*(1-X979)/1000,O979*N979(1-X979)/1000)),IF(AND(E979=\"\",L979=\"\"),\"\",0))","v":""},"","","","","",null,null,0,{"$nulls":3},"No"]
[null,961,{"$nulls":5},"",null,{"$f":"IF(AND(E980<>\"\",G980<>\"\",$E$8=\"Default Sector Hours\"),VLOOKUP(IF(R980=\"Exterior\",\"Exterior\",$E$7),$W$1036:$X$1041,2,FALSE),\"\")","v":""},{"$nulls":4},{"$f":"IF(L980=\"\",\"\",VLOOKUP(L980,$AQ$1113:$AR$1541,2,FALSE))","v":""},null,"",null,"No",null,"",{"v":0,"d":"0.0000"},"",{"v":0,"d":"0.00"},{"$f":"IF(R980=\"Interior\",IF(AND(L980=\"\",E980=\"\"),\"\",IF(OR(P980>0,O980=\"Enter Watts\",P980=\"\"),P980*N980*(1-X980)/1000,O980*N980(1-X980)/1000)),IF(AND(E980=\"\",L980=\"\"),\"\",0))","v":""},{"$f":"IFERROR(IF(AND(L980=\"\", E980=\"\"),\"\",N980/1000*IF(OR(P980>0,O980=\"Enter Watts\"),P980,O980)*IF(R980=\"Exterior\",$X$1041,IF($E$8=\"Manual Input\",Q980,VLOOKUP($E$7,$W$1036:$Z$1040,2,FALSE)))*IF(S980=\"Yes\",IF(R980=\"Exterior\",1-$Z$1041,1-VLOOKUP($E$7,$W$1036:$Z$1040,4,FALSE)),1)),0)","v":""},"",{"$f":"IF(AND(U980=\"\",Y980=\"\"),\"\",IF(OR(U980=\"\",Y980=\"\"),0,  IF($E$8=\"Manual Input\",$G$9,   VLOOKUP($E$7,$W$1036:$Z$1041,3,FALSE))     *(U980-Y980)))","v":""},"","",null,null,0,{"$nulls":3},"No"]
[null,962,{"$nulls":5},"",null,"",{"$nulls":4},"",null,"",null,"No",null,{"$f":"IF(V981=\"Int Control\",IF(E981=\"\",\"\",IF(OR(I981>0,H981=\"Enter Watts\"),I981*G981/1000*(1-$E$15),H981*G981/1000*(1-$E$15))),IF(E981=\"\",\"\",IF(OR(I981>0,H981=\"Enter Watts\"),I981*G981/1000,H981*G981/1000)))","v":""},{"$f":"IF(AND(R981=\"Interior\",S981=\"Yes\"),\"Int Control\",0)","v":{"v":0,"d":"0.0000"}},{"$f":"IFERROR(IF(V981=\"Int Control\",IF(E981=\"\",\"\",G981/1000*(1-$E$15)*IF(OR(I981>0,H981=\"Enter Watts\"),I981,H981)*IF(R981=\"Exterior\",$X$1041*(1-$G$15),IF($E$8=\"Manual Input\",J981,VLOOKUP($E$7,$W$1036:$Z$1040,2,FALSE)*(1-$E$15)))),IF(E981=\"\",\"\",G981/1000*IF(OR(I981>0,H981=\"Enter Watts\"),I981,H981)*IF(R981=\"Exterior\",$X$1041,IF($E$8=\"Manual Input\",J981,VLOOKUP($E$7,$W$1036:$Z$1040,2,FALSE))))),\"0\")","v":""},{"$f":"IF(S981=\"No\",0,AA$1036)","v":{"v":0,"d":"0.00"}},{"$f":"IF(R981=\"Interior\",IF(AND(L981=\"\",E981=\"\"),\"\",IF(OR(P981>0,O981=\"Enter Watts\",P981=\"\"),P981*N981*(1-X981)/1000,O981*N981(1-X981)/1000)),IF(AND(E981=\"\",L981=\"\"),\"\",0))","v":""},"","","","","",null,null,{"$f":"AF981*N981","v":0},{"$nulls":3},{"$f":"IF(_xlfn.ISFORMULA(J981)=TRUE,\"No\",\"Yes\")","v":"No"},{"$nulls":6},"","",null,""]
[null,963,{"$nulls":5},"",null,"",{"$nulls":4},"",null,"",null,"No",null,"",{"v":0,"d":"0.0000"},"",{"v":0,"d":"0.00"},{"$f":"IF(R982=\"Interior\",IF(AND(L982=\"\",E982=\"\"),\"\",IF(OR(P982>0,O982=\"Enter Watts\",P982=\"\"),P982*N982*(1-X982)/1000,O982*N982(1-X982)/1000)),IF(AND(E982=\"\",L982=\"\"),\"\",0))","v":""},"","","","","",null,null,0,{"$nulls":3},"No"]
[null,964,{"$nulls":5},"",null,"",{"$nulls":4},"",null,"",null,"No",null,"",{"v":0,"d":"0.0000"},"",{"v":0,"d":"0.00"},{"$f":"IF(R983=\"Interior\",IF(AND(L983=\"\",E983=\"\"),\"\",IF(OR(P983>0,O983=\"Enter Watts\",P983=\"\"),P983*N983*(1-X983)/1000,O983*N983(1-X983)/1000)),IF(AND(E983=\"\",L983=\"\"),\"\",0))","v":""},"","","","","",null,null,0,{"$nulls":3},"No"]
[null,965,{"$nulls":5},"",null,"",{"$nulls":4},"",null,"",null,"No",null,"",{"v":0,"d":"0.0000"},"",{"v":0,"d":"0.00"},{"$f":"IF(R984=\"Interior\",IF(AND(L984=\"\",E984=\"\"),\"\",IF(OR(P984>0,O984=\"Enter Watts\",P984=\"\"),P984*N984*(1-X984)/1000,O984*N984(1-X984)/1000)),IF(AND(E984=\"\",L984=\"\"),\"\",0))","v":""},"","","","","",null,null,0,{"$nulls":3},"No"]
[null,966,{"$nulls":5},"",null,"",{"$nulls":4},"",null,"",null,"No",null,"",{"v":0,"d":"0.0000"},"",{"v":0,"d":"0.00"},{"$f":"IF(R985=\"Interior\",IF(AND(L985=\"\",E985=\"\"),\"\",IF(OR(P985>0,O985=\"Enter Watts\",P985=\"\"),P985*N985*(1-X985)/1000,O985*N985(1-X985)/1000)),IF(AND(E985=\"\",L985=\"\"),\"\",0))","v":""},"","","","","",null,null,0,{"$nulls":3},"No"]
[null,967,{"$nulls":5},"",null,"",{"$nulls":4},"",null,"",null,"No",null,"",{"v":0,"d":"0.0000"},"",{"v":0,"d":"0.00"},{"$f":"IF(R986=\"Interior\",IF(AND(L986=\"\",E986=\"\"),\"\",IF(OR(P986>0,O986=\"Enter Watts\",P986=\"\"),P986*N986*(1-X986)/1000,O986*N986(1-X986)/1000)),IF(AND(E986=\"\",L986=\"\"),\"\",0))","v":""},"","","","","",null,null,0,{"$nulls":3},"No"]
[null,968,{"$nulls":5},"",null,"",{"$nulls":4},"",null,"",null,"No",null,"",{"v":0,"d":"0.0000"},"",{"v":0,"d":"0.00"},{"$f":"IF(R987=\"Interior\",IF(AND(L987=\"\",E987=\"\"),\"\",IF(OR(P987>0,O987=\"Enter Watts\",P987=\"\"),P987*N987*(1-X987)/1000,O987*N987(1-X987)/1000)),IF(AND(E987=\"\",L987=\"\"),\"\",0))","v":""},"","","","","",null,null,0,{"$nulls":3},"No"]
[null,969,{"$nulls":5},"",null,"",{"$nulls":4},"",null,"",null,"No",null,"",{"v":0,"d":"0.0000"},"",{"v":0,"d":"0.00"},{"$f":"IF(R988=\"Interior\",IF(AND(L988=\"\",E988=\"\"),\"\",IF(OR(P988>0,O988=\"Enter Watts\",P988=\"\"),P988*N988*(1-X988)/1000,O988*N988(1-X988)/1000)),IF(AND(E988=\"\",L988=\"\"),\"\",0))","v":""},"","","","","",null,null,0,{"$nulls":3},"No",{"$nulls":6},"","",null,""]
[null,970,{"$nulls":5},"",null,"",{"$nulls":4},"",null,"",null,"No",null,"",{"v":0,"d":"0.0000"},"",{"v":0,"d":"0.00"},{"$f":"IF(R989=\"Interior\",IF(AND(L989=\"\",E989=\"\"),\"\",IF(OR(P989>0,O989=\"Enter Watts\",P989=\"\"),P989*N989*(1-X989)/1000,O989*N989(1-X989)/1000)),IF(AND(E989=\"\",L989=\"\"),\"\",0))","v":""},"","","","","",null,null,0,{"$nulls":3},"No"]
[null,971,{"$nulls":5},"",null,"",{"$nulls":4},"",null,"",null,"No",null,"",{"v":0,"d":"0.0000"},"",{"v":0,"d":"0.00"},{"$f":"IF(R990=\"Interior\",IF(AND(L990=\"\",E990=\"\"),\"\",IF(OR(P990>0,O990=\"Enter Watts\",P990=\"\"),P990*N990*(1-X990)/1000,O990*N990(1-X990)/1000)),IF(AND(E990=\"\",L990=\"\"),\"\",0))","v":""},"","","","","",null,null,0,{"$nulls":3},"No"]
[null,972,{"$nulls":5},"",null,"",{"$nulls":4},"",null,"",null,"No",null,"",{"v":0,"d":"0.0000"},"",{"v":0,"d":"0.00"},{"$f":"IF(R991=\"Interior\",IF(AND(L991=\"\",E991=\"\"),\"\",IF(OR(P991>0,O991=\"Enter Watts\",P991=\"\"),P991*N991*(1-X991)/1000,O991*N991(1-X991)/1000)),IF(AND(E991=\"\",L991=\"\"),\"\",0))","v":""},"","","","","",null,null,0,{"$nulls":3},"No"]
[null,973,{"$nulls":5},"",null,"",{"$nulls":4},"",null,"",null,"No",null,"",{"v":0,"d":"0.0000"},"",{"v":0,"d":"0.00"},{"$f":"IF(R992=\"Interior\",IF(AND(L992=\"\",E992=\"\"),\"\",IF(OR(P992>0,O992=\"Enter Watts\",P992=\"\"),P992*N992*(1-X992)/1000,O992*N992(1-X992)/1000)),IF(AND(E992=\"\",L992=\"\"),\"\",0))","v":""},"","","","","",null,null,0,{"$nulls":3},"No"]
[null,974,{"$nulls":5},"",null,"",{"$nulls":4},"",null,"",null,"No",null,"",{"v":0,"d":"0.0000"},"",{"v":0,"d":"0.00"},{"$f":"IF(R993=\"Interior\",IF(AND(L993=\"\",E993=\"\"),\"\",IF(OR(P993>0,O993=\"Enter Watts\",P993=\"\"),P993*N993*(1-X993)/1000,O993*N993(1-X993)/1000)),IF(AND(E993=\"\",L993=\"\"),\"\",0))","v":""},"","","","","",null,null,0,{"$nulls":3},"No"]
[null,975,{"$nulls":5},"",null,"",{"$nulls":4},"",null,"",null,"No",null,"",{"v":0,"d":"0.0000"},"",{"v":0,"d":"0.00"},{"$f":"IF(R994=\"Interior\",IF(AND(L994=\"\",E994=\"\"),\"\",IF(OR(P994>0,O994=\"Enter Watts\",P994=\"\"),P994*N994*(1-X994)/1000,O994*N994(1-X994)/1000)),IF(AND(E994=\"\",L994=\"\"),\"\",0))","v":""},"","","","","",null,null,0,{"$nulls":3},"No",{"$nulls":6},"","",null,""]
[null,976,{"$nulls":5},"",null,"",{"$nulls":4},"",null,"",null,"No",null,"",{"v":0,"d":"0.0000"},"",{"v":0,"d":"0.00"},{"$f":"IF(R995=\"Interior\",IF(AND(L995=\"\",E995=\"\"),\"\",IF(OR(P995>0,O995=\"Enter Watts\",P995=\"\"),P995*N995*(1-X995)/1000,O995*N995(1-X995)/1000)),IF(AND(E995=\"\",L995=\"\"),\"\",0))","v":""},"","","","","",null,null,0,{"$nulls":3},"No"]
[null,977,{"$nulls":5},"",null,"",{"$nulls":4},"",null,"",null,"No",null,"",{"v":0,"d":"0.0000"},"",{"v":0,"d":"0.00"},{"$f":"IF(R996=\"Interior\",IF(AND(L996=\"\",E996=\"\"),\"\",IF(OR(P996>0,O996=\"Enter Watts\",P996=\"\"),P996*N996*(1-X996)/1000,O996*N996(1-X996)/1000)),IF(AND(E996=\"\",L996=\"\"),\"\",0))","v":""},"","","","","",null,null,0,{"$nulls":3},"No"]
[null,978,{"$nulls":5},"",null,"",{"$nulls":4},"",null,"",null,"No",null,"",{"v":0,"d":"0.0000"},"",{"v":0,"d":"0.00"},{"$f":"IF(R997=\"Interior\",IF(AND(L997=\"\",E997=\"\"),\"\",IF(OR(P997>0,O997=\"Enter Watts\",P997=\"\"),P997*N997*(1-X997)/1000,O997*N997(1-X997)/1000)),IF(AND(E997=\"\",L997=\"\"),\"\",0))","v":""},"","","","","",null,null,0,{"$nulls":3},"No"]
[null,979,{"$nulls":5},"",null,"",{"$nulls":4},"",null,"",null,"No",null,"",{"v":0,"d":"0.0000"},"",{"v":0,"d":"0.00"},{"$f":"IF(R998=\"Interior\",IF(AND(L998=\"\",E998=\"\"),\"\",IF(OR(P998>0,O998=\"Enter Watts\",P998=\"\"),P998*N998*(1-X998)/1000,O998*N998(1-X998)/1000)),IF(AND(E998=\"\",L998=\"\"),\"\",0))","v":""},"","","","","",null,null,0,{"$nulls":3},"No"]
[null,980,{"$nulls":5},"",null,"",{"$nulls":4},"",null,"",null,"No",null,"",{"v":0,"d":"0.0000"},"",{"v":0,"d":"0.00"},{"$f":"IF(R999=\"Interior\",IF(AND(L999=\"\",E999=\"\"),\"\",IF(OR(P999>0,O999=\"Enter Watts\",P999=\"\"),P999*N999*(1-X999)/1000,O999*N999(1-X999)/1000)),IF(AND(E999=\"\",L999=\"\"),\"\",0))","v":""},"","","","","",null,null,0,{"$nulls":3},"No"]
[null,981,{"$nulls":5},"",null,"",{"$nulls":4},"",null,"",null,"No",null,"",{"v":0,"d":"0.0000"},"",{"v":0,"d":"0.00"},{"$f":"IF(R1000=\"Interior\",IF(AND(L1000=\"\",E1000=\"\"),\"\",IF(OR(P1000>0,O1000=\"Enter Watts\",P1000=\"\"),P1000*N1000*(1-X1000)/1000,O1000*N1000(1-X1000)/1000)),IF(AND(E1000=\"\",L1000=\"\"),\"\",0))","v":""},"","","","","",null,null,0,{"$nulls":3},"No"]
[null,982,{"$nulls":5},"",null,"",{"$nulls":4},"",null,"",null,"No",null,"",{"v":0,"d":"0.0000"},"",{"v":0,"d":"0.00"},{"$f":"IF(R1001=\"Interior\",IF(AND(L1001=\"\",E1001=\"\"),\"\",IF(OR(P1001>0,O1001=\"Enter Watts\",P1001=\"\"),P1001*N1001*(1-X1001)/1000,O1001*N1001(1-X1001)/1000)),IF(AND(E1001=\"\",L1001=\"\"),\"\",0))","v":""},"","","","","",null,null,0,{"$nulls":3},"No"]
[null,983,{"$nulls":5},"",null,"",{"$nulls":4},"",null,"",null,"No",null,"",{"v":0,"d":"0.0000"},"",{"v":0,"d":"0.00"},{"$f":"IF(R1002=\"Interior\",IF(AND(L1002=\"\",E1002=\"\"),\"\",IF(OR(P1002>0,O1002=\"Enter Watts\",P1002=\"\"),P1002*N1002*(1-X1002)/1000,O1002*N1002(1-X1002)/1000)),IF(AND(E1002=\"\",L1002=\"\"),\"\",0))","v":""},"","","","","",null,null,0,{"$nulls":3},"No"]
[null,984,{"$nulls":5},"",null,"",{"$nulls":4},"",null,"",null,"No",null,"",{"v":0,"d":"0.0000"},"",{"v":0,"d":"0.00"},{"$f":"IF(R1003=\"Interior\",IF(AND(L1003=\"\",E1003=\"\"),\"\",IF(OR(P1003>0,O1003=\"Enter Watts\",P1003=\"\"),P1003*N1003*(1-X1003)/1000,O1003*N1003(1-X1003)/1000)),IF(AND(E1003=\"\",L1003=\"\"),\"\",0))","v":""},"","","","","",null,null,0,{"$nulls":3},"No"]
[null,985,{"$nulls":5},"",null,"",{"$nulls":4},"",null,"",null,"No",null,"",{"v":0,"d":"0.0000"},"",{"v":0,"d":"0.00"},{"$f":"IF(R1004=\"Interior\",IF(AND(L1004=\"\",E1004=\"\"),\"\",IF(OR(P1004>0,O1004=\"Enter Watts\",P1004=\"\"),P1004*N1004*(1-X1004)/1000,O1004*N1004(1-X1004)/1000)),IF(AND(E1004=\"\",L1004=\"\"),\"\",0))","v":""},"","","","","",null,null,0,{"$nulls":3},"No"]
[null,986,{"$nulls":5},"",null,"",{"$nulls":4},"",null,"",null,"No",null,"",{"v":0,"d":"0.0000"},"",{"v":0,"d":"0.00"},{"$f":"IF(R1005=\"Interior\",IF(AND(L1005=\"\",E1005=\"\"),\"\",IF(OR(P1005>0,O1005=\"Enter Watts\",P1005=\"\"),P1005*N1005*(1-X1005)/1000,O1005*N1005(1-X1005)/1000)),IF(AND(E1005=\"\",L1005=\"\"),\"\",0))","v":""},"","","","","",null,null,0,{"$nulls":3},"No"]
[null,987,{"$nulls":5},"",null,"",{"$nulls":4},"",null,"",null,"No",null,"",{"v":0,"d":"0.0000"},"",{"v":0,"d":"0.00"},{"$f":"IF(R1006=\"Interior\",IF(AND(L1006=\"\",E1006=\"\"),\"\",IF(OR(P1006>0,O1006=\"Enter Watts\",P1006=\"\"),P1006*N1006*(1-X1006)/1000,O1006*N1006(1-X1006)/1000)),IF(AND(E1006=\"\",L1006=\"\"),\"\",0))","v":""},"","","","","",null,null,0,{"$nulls":3},"No",{"$nulls":6},"","",null,""]
[null,988,{"$nulls":5},"",null,"",{"$nulls":4},"",null,"",null,"No",null,"",{"v":0,"d":"0.0000"},"",{"v":0,"d":"0.00"},{"$f":"IF(R1007=\"Interior\",IF(AND(L1007=\"\",E1007=\"\"),\"\",IF(OR(P1007>0,O1007=\"Enter Watts\",P1007=\"\"),P1007*N1007*(1-X1007)/1000,O1007*N1007(1-X1007)/1000)),IF(AND(E1007=\"\",L1007=\"\"),\"\",0))","v":""},"","","","","",null,null,0,{"$nulls":3},"No"]
[null,989,{"$nulls":5},"",null,"",{"$nulls":4},"",null,"",null,"No",null,"",{"v":0,"d":"0.0000"},"",{"v":0,"d":"0.00"},{"$f":"IF(R1008=\"Interior\",IF(AND(L1008=\"\",E1008=\"\"),\"\",IF(OR(P1008>0,O1008=\"Enter Watts\",P1008=\"\"),P1008*N1008*(1-X1008)/1000,O1008*N1008(1-X1008)/1000)),IF(AND(E1008=\"\",L1008=\"\"),\"\",0))","v":""},"","","","","",null,null,0,{"$nulls":3},"No"]
[null,990,{"$nulls":5},"",null,"",{"$nulls":4},"",null,"",null,"No",null,"",{"v":0,"d":"0.0000"},"",{"v":0,"d":"0.00"},{"$f":"IF(R1009=\"Interior\",IF(AND(L1009=\"\",E1009=\"\"),\"\",IF(OR(P1009>0,O1009=\"Enter Watts\",P1009=\"\"),P1009*N1009*(1-X1009)/1000,O1009*N1009(1-X1009)/1000)),IF(AND(E1009=\"\",L1009=\"\"),\"\",0))","v":""},"","","","","",null,null,0,{"$nulls":3},"No"]
[null,991,{"$nulls":5},"",null,"",{"$nulls":4},"",null,"",null,"No",null,"",{"v":0,"d":"0.0000"},"",{"v":0,"d":"0.00"},{"$f":"IF(R1010=\"Interior\",IF(AND(L1010=\"\",E1010=\"\"),\"\",IF(OR(P1010>0,O1010=\"Enter Watts\",P1010=\"\"),P1010*N1010*(1-X1010)/1000,O1010*N1010(1-X1010)/1000)),IF(AND(E1010=\"\",L1010=\"\"),\"\",0))","v":""},"","","","","",null,null,0,{"$nulls":3},"No"]
[null,992,{"$nulls":5},"",null,"",{"$nulls":4},"",null,"",null,"No",null,"",{"v":0,"d":"0.0000"},"",{"v":0,"d":"0.00"},{"$f":"IF(R1011=\"Interior\",IF(AND(L1011=\"\",E1011=\"\"),\"\",IF(OR(P1011>0,O1011=\"Enter Watts\",P1011=\"\"),P1011*N1011*(1-X1011)/1000,O1011*N1011(1-X1011)/1000)),IF(AND(E1011=\"\",L1011=\"\"),\"\",0))","v":""},"","","","","",null,null,0,{"$nulls":3},"No"]
[null,993,{"$nulls":5},"",null,"",{"$nulls":4},"",null,"",null,"No",null,"",{"v":0,"d":"0.0000"},"",{"v":0,"d":"0.00"},{"$f":"IF(R1012=\"Interior\",IF(AND(L1012=\"\",E1012=\"\"),\"\",IF(OR(P1012>0,O1012=\"Enter Watts\",P1012=\"\"),P1012*N1012*(1-X1012)/1000,O1012*N1012(1-X1012)/1000)),IF(AND(E1012=\"\",L1012=\"\"),\"\",0))","v":""},"","","","","",null,null,0,{"$nulls":3},"No",{"$nulls":6},"","",null,""]
[null,994,{"$nulls":5},"",null,"",{"$nulls":4},"",null,"",null,"No",null,"",{"v":0,"d":"0.0000"},"",{"v":0,"d":"0.00"},{"$f":"IF(R1013=\"Interior\",IF(AND(L1013=\"\",E1013=\"\"),\"\",IF(OR(P1013>0,O1013=\"Enter Watts\",P1013=\"\"),P1013*N1013*(1-X1013)/1000,O1013*N1013(1-X1013)/1000)),IF(AND(E1013=\"\",L1013=\"\"),\"\",0))","v":""},"","","","","",null,null,0,{"$nulls":3},"No"]
[null,995,{"$nulls":5},"",null,"",{"$nulls":4},"",null,"",null,"No",null,"",{"v":0,"d":"0.0000"},"",{"v":0,"d":"0.00"},{"$f":"IF(R1014=\"Interior\",IF(AND(L1014=\"\",E1014=\"\"),\"\",IF(OR(P1014>0,O1014=\"Enter Watts\",P1014=\"\"),P1014*N1014*(1-X1014)/1000,O1014*N1014(1-X1014)/1000)),IF(AND(E1014=\"\",L1014=\"\"),\"\",0))","v":""},"","","","","",null,null,0,{"$nulls":3},"No"]
[null,996,{"$nulls":5},"",null,"",{"$nulls":4},"",null,"",null,"No",null,"",{"v":0,"d":"0.0000"},"",{"v":0,"d":"0.00"},{"$f":"IF(R1015=\"Interior\",IF(AND(L1015=\"\",E1015=\"\"),\"\",IF(OR(P1015>0,O1015=\"Enter Watts\",P1015=\"\"),P1015*N1015*(1-X1015)/1000,O1015*N1015(1-X1015)/1000)),IF(AND(E1015=\"\",L1015=\"\"),\"\",0))","v":""},"","","","","",null,null,0,{"$nulls":3},"No"]
[null,997,{"$nulls":5},"",null,"",{"$nulls":4},"",null,"",null,"No",null,"",{"v":0,"d":"0.0000"},"",{"v":0,"d":"0.00"},{"$f":"IF(R1016=\"Interior\",IF(AND(L1016=\"\",E1016=\"\"),\"\",IF(OR(P1016>0,O1016=\"Enter Watts\",P1016=\"\"),P1016*N1016*(1-X1016)/1000,O1016*N1016(1-X1016)/1000)),IF(AND(E1016=\"\",L1016=\"\"),\"\",0))","v":""},"","","","","",null,null,0,{"$nulls":3},"No"]
[null,998,{"$nulls":5},"",null,"",{"$nulls":4},"",null,"",null,"No",null,"",{"v":0,"d":"0.0000"},"",{"v":0,"d":"0.00"},{"$f":"IF(R1017=\"Interior\",IF(AND(L1017=\"\",E1017=\"\"),\"\",IF(OR(P1017>0,O1017=\"Enter Watts\",P1017=\"\"),P1017*N1017*(1-X1017)/1000,O1017*N1017(1-X1017)/1000)),IF(AND(E1017=\"\",L1017=\"\"),\"\",0))","v":""},"","","","","",null,null,0,{"$nulls":3},"No"]
[null,999,{"$nulls":5},"",null,"",{"$nulls":4},"",null,"",null,"No",null,"",{"v":0,"d":"0.0000"},"",{"v":0,"d":"0.00"},{"$f":"IF(R1018=\"Interior\",IF(AND(L1018=\"\",E1018=\"\"),\"\",IF(OR(P1018>0,O1018=\"Enter Watts\",P1018=\"\"),P1018*N1018*(1-X1018)/1000,O1018*N1018(1-X1018)/1000)),IF(AND(E1018=\"\",L1018=\"\"),\"\",0))","v":""},"","","","","",null,null,0,{"$nulls":3},"No"]
[null,1000,{"$nulls":5},"",null,"",{"$nulls":4},"",null,"",null,"No",null,"",{"v":0,"d":"0.0000"},"",{"v":0,"d":"0.00"},{"$f":"IF(R1019=\"Interior\",IF(AND(L1019=\"\",E1019=\"\"),\"\",IF(OR(P1019>0,O1019=\"Enter Watts\",P1019=\"\"),P1019*N1019*(1-X1019)/1000,O1019*N1019(1-X1019)/1000)),IF(AND(E1019=\"\",L1019=\"\"),\"\",0))","v":""},"","","","","",null,null,0,{"$nulls":3},"No"]
[{"$nulls":5},"Totals:",{"$f":"SUM(G20:G1019)","v":0},{"$nulls":6},{"$f":"SUM(N20:N1019)","v":0},{"$nulls":18},{"$f":"SUM(AG20:AG1019)","v":0}]
[]
[]
[]
[]
[null,null,"EUL Source:  Workpaper",{"$nulls":7},"Savings for Project by Measure ID "]
[null,null,"Measure Master ID","Measure Master Name",null,"Group / Measure Type","EUL",null,null,"MMID","Peak kW","Annual kWh","Lifecycle kWh","Annual Energy Cost Savings",null,"Incentive Rate",null,"Watts Reduced","Incentive by Code",{"$nulls":3},"Cost Effectiveness ($/MMBtu)"]
[null,{"$f":"C1027&\" - \"&D1027","v":"L5029 - CLS - Fixture or Retrofit Kit Only"},"L5029","CLS - Fixture or Retrofit Kit Only",null,"Lighting / Custom",15,null,null,"L5029",{"$f":"ROUND(SUMIF($AD$20:$AD$1019,$J1027,$AB$20:$AB$1019),4)","v":{"v":0,"d":"0.0000"}},{"$f":"ROUND(SUMIF($AD$20:$AD$1019,$J1027,$AC$20:$AC$1019),0)","v":0},{"$f":"L1027*G1027","v":0},{"$f":"L1027*E$11","v":{"v":0,"d":"$0.00"}},null,{"v":0.25,"d":"$0.25"},null,{"$f":"IFERROR(ROUND(SUMIF($AD$20:$AD$1019,$J1027,$AA$20:$AA$1019),0),\"\")","v":0},{"$f":"IFERROR(R1027*P1027,\"\")","v":{"v":0,"d":"$0.00"}},{"$nulls":3},{"$f":"IFERROR(S1027/(M1027*0.003412),0)","v":{"v":0,"d":"$0.00"}}]
[null,"L5031 - CLS - Fixture or Retrofit Kit/Lamp with Connected Controls, Interior","L5031","CLS - Fixture or Retrofit Kit/Lamp with Connected Controls, Interior",null,"Lighting / Custom",15,null,null,"L5031",{"$f":"ROUND(SUMIF($AD$20:$AD$1019,$J1028,$AB$20:$AB$1019),4)","v":{"v":0,"d":"0.0000"}},{"$f":"ROUND(SUMIF($AD$20:$AD$1019,$J1028,$AC$20:$AC$1019),0)","v":0},{"$f":"L1028*G1028","v":0},{"$f":"L1028*E$11","v":{"v":0,"d":"$0.00"}},null,{"v":0.45,"d":"$0.45"},null,{"$f":"IFERROR(ROUND(SUMIF($AD$20:$AD$1019,$J1028,$AA$20:$AA$1019),0),\"\")","v":0},{"$f":"IFERROR(R1028*P1028,\"\")","v":{"v":0,"d":"$0.00"}},{"$nulls":3},{"$f":"IFERROR(S1028/(M1028*0.003412),0)","v":{"v":0,"d":"$0.00"}}]
[null,"L5030 - CLS - Fixture or Retrofit Kit/Lamp with Connected Controls, Exterior","L5030","CLS - Fixture or Retrofit Kit/Lamp with Connected Controls, Exterior",null,"Lighting / Custom",15,null,null,"L5030",{"$f":"ROUND(SUMIF($AD$20:$AD$1019,$J1029,$AB$20:$AB$1019),4)","v":{"v":0,"d":"0.0000"}},{"$f":"ROUND(SUMIF($AD$20:$AD$1019,$J1029,$AC$20:$AC$1019),0)","v":0},{"$f":"L1029*G1029","v":0},{"$f":"L1029*E12","v":{"v":0,"d":"$0.00"}},null,{"v":0.5,"d":"$0.50"},null,{"$f":"IFERROR(ROUND(SUMIF($AD$20:$AD$1019,$J1029,$AA$20:$AA$1019),0),\"\")","v":0},{"$f":"IFERROR(R1029*P1029,\"\")","v":{"v":0,"d":"$0.00"}},{"$nulls":3},{"$f":"IFERROR(S1029/(M1029*0.003412),0)","v":{"v":0,"d":"$0.00"}}]
[{"$nulls":18},"Total Incentive"]
[{"$nulls":18},{"$f":"MIN(SUM(S1027:U1029))","v":{"v":0,"d":"$0.00"}}]
[{"$nulls":19},"Check Savings & Incentives tab for Incentive caps"]
[null,null,"Additional Notes / Supporting Docs",{"$nulls":26},"Source: IL TRM, V8.0, October 2019"]
[{"$nulls":22},"Default Sector Values",{"$nulls":6},"Volume 2: Commercial and Industrial Measures, Page 430."]
[{"$nulls":22},"Sector","HOU","CF","SF","SF ACTIVE",null,null,"Building/Space Type","Coincidence Factor"]
[{"$nulls":22},"Commercial",3730,0.77,0.56,{"$f":"VLOOKUP($E$7,W1036:Z1041,4,FALSE)","v":{"$error":"#N/A"}},null,null,"_Sector Default_",{"$f":"VLOOKUP(E7,$W$1036:$Z$1041,3,FALSE)","v":{"$error":"#N/A"}}]
[{"$nulls":22},"Industrial",4745,0.77,0.47,{"$nulls":3},"Assisted Living",0.66]
[{"$nulls":22},"Multifamily",5950,0.77,0.49,{"$nulls":3},"Auto Dealership",0.97]
[{"$nulls":22},"Schools & Gov",3239,0.64,0.41,{"$nulls":3},"Childcare/Pre-School",0.72]
[{"$nulls":29},"College",0.63]
[{"$nulls":22},"Exterior",4380,0,0.5,{"$nulls":3},"Convenience Store",0.76]
[{"$nulls":29},"Drug Store",{"v":1,"d":"1.00"}]
[{"$nulls":22},"Default Utility Rates",{"$nulls":6},"Elementary School",0.65]
[{"$nulls":22},"Sector","$/kWh",{"$nulls":5},"Grocery",0.82]
[{"$nulls":22},"Commercial/Schools & Government",{"$f":"'Savings and Incentives'!D52","v":{"v":0.1109,"d":"$0.1109"}},{"$nulls":5},"Healthcare Clinic",0.67]
[{"$nulls":22},"Industrial",{"$f":"'Savings and Incentives'!D53","v":{"v":0.0776,"d":"$0.0776"}},{"$nulls":5},"High School",0.65]
[{"$nulls":22},"Residential",{"$f":"'Savings and Incentives'!D54","v":{"v":0.1587,"d":"$0.1587"}},{"$nulls":5},"Hospital",0.56]
[{"$nulls":22},"EIA 2022 Annual Rates",{"$nulls":6},"Manufacturing Facility",0.81]
[{"$nulls":29},"Multifamily High Rise - Common Area",{"v":0.9,"d":"0.90"}]
[{"$nulls":29},"Multifamily Mid Rise - Common Area",0.62]
[{"$nulls":29},"Hotel/Motel - Guest Rooms",0.46,{"$nulls":10},"Version: 1.0"]
[{"$nulls":29},"Hotel/Motel - Common Area",0.85,{"$nulls":10},"Release Date: 4/4/2013"]
[{"$nulls":29},"Movie Theater",0.53,{"$nulls":10},"Notes:"]
[{"$nulls":29},"Office - High Rise",{"v":0.6,"d":"0.60"},{"$nulls":10},"*Compiled using values from the following sources 2010 Xcel Energy wattage guide,  2007 Centerpoint Energy Wattage Table, and various manufacturers literature. "]
[{"$nulls":29},"Office - Mid Rise",{"v":0.6,"d":"0.60"},{"$nulls":10},"*Unless denoted all wattage values shown for linear fluorescent products assume a normal ballast factor ballast "]
[{"$nulls":29},"Office - Low Rise",0.52,{"$nulls":10},"*HB = High Bay w/ a high ballast factor ballast"]
[{"$nulls":29},"Public Sector",0.65,{"$nulls":10},"*HO = High Output Lamps and Ballasts"]
[{"$nulls":29},"Religious Building",0.48,{"$nulls":10},"*VHO = Very High Output Lamps and Ballasts"]
[{"$nulls":29},"Restaurant",{"v":1,"d":"1.00"}]
[{"$nulls":29},"Retail - Department Store",0.94,{"$nulls":10},"Category (no Duplicates)","Named Range"]
[{"$nulls":29},"Retail - Strip Mall",0.71,{"$nulls":10},"**Removed**","RemovedNoReplacement"]
[{"$nulls":29},"Warehouse",0.85,{"$nulls":10},"Ceramic Metal Halide","CeramicMetalHalide"]
[{"$nulls":29},"Coincidence Factor = 0.10",{"v":0.1,"d":"0.10"},{"$nulls":10},"CMH and PSMH Lamps","CMHandPSMHLamps"]
[{"$nulls":29},"Coincidence Factor = 0.20",{"v":0.2,"d":"0.20"},{"$nulls":10},"CFL 2 Pin Based","CFL2PinBased"]
[{"$nulls":29},"Coincidence Factor = 0.30",{"v":0.3,"d":"0.30"},{"$nulls":10},"CFL 4 Pin Based","CFL4PinBased"]
[{"$nulls":29},"Coincidence Factor = 0.40",{"v":0.4,"d":"0.40"},{"$nulls":10},"CFL w/ Integral Ballast Screw or GU24","CFLWithIntegralBallastScrewOrGU24Based"]
[{"$nulls":29},"Coincidence Factor = 0.50",{"v":0.5,"d":"0.50"},{"$nulls":10},"Cold Cathode Screw Based Lamp","ColdCathodeFluorescentScrewBasedLamps"]
[{"$nulls":29},"Coincidence Factor = 0.60",{"v":0.6,"d":"0.60"},{"$nulls":10},"Exit Signs","ExitSigns"]
[{"$nulls":29},"Coincidence Factor = 0.70",{"v":0.7,"d":"0.70"},{"$nulls":10},"Fluorescent - T12 1.5ft","T12_1.5ft"]
[{"$nulls":29},"Coincidence Factor = 0.80",{"v":0.8,"d":"0.80"},{"$nulls":10},"Fluorescent - T12 2ft","T12_2ft"]
[{"$nulls":29},"Coincidence Factor = 0.90",{"v":0.9,"d":"0.90"},{"$nulls":10},"Fluorescent - T12 3ft","T12_3ft"]
[{"$nulls":29},"Coincidence Factor = 1.00",{"v":1,"d":"1.00"},{"$nulls":10},"Fluorescent - T12 4ft","T12_4ft"]
[{"$nulls":41},"Fluorescent - T12 5ft","T12_5ft"]
[{"$nulls":41},"Fluorescent - T12 6ft","T12_6ft"]
[{"$nulls":41},"Fluorescent - T12 8ft","T12_8ft"]
[{"$nulls":41},"Fluorescent - T12 U-tube","T12U_tube"]
[{"$nulls":41},"Fluorescent - T5 and T5HO 2ft","T5_2ft"]
[{"$nulls":41},"Fluorescent - T5 and T5HO 3ft","T5_3ft"]
[{"$nulls":41},"Fluorescent - T5 and T5HO 4ft","T5_4ft"]
[{"$nulls":41},"Fluorescent - T8 1.5ft","T8_1.5ft"]
[{"$nulls":41},"Fluorescent - T8 2ft","T8_2ft"]
[{"$nulls":41},"Fluorescent - T8 3ft","T8_3ft"]
[{"$nulls":41},"Fluorescent - T8 4ft","T8_4ft"]
[{"$nulls":41},"Fluorescent - T8 4ft (Std ballast, RW lamps)","T8_4ft_StdBallastRWlamp"]
[{"$nulls":41},"Fluorescent - HPT8 4ft","HPT8_4ft"]
[{"$nulls":41},"Fluorescent - RWT8 4ft","RWT8_4ft"]
[{"$nulls":41},"Fluorescent - T8 5ft","T8_5ft"]
[{"$nulls":41},"Fluorescent - T8 8ft","T8_8ft"]
[{"$nulls":41},"Fluorescent - T8 U-tube","T8U_tube"]
[{"$nulls":41},"Fluorescent - T8 4ft Lamp Only","T8_4ft_Lamp"]
[{"$nulls":41},"Fluorescent - T8 8ft Lamp Only","T8_8ft_Lamp"]
[{"$nulls":41},"High Pressure Sodium","HighPressureSodium"]
[{"$nulls":41},"Incandescent","Incandescent"]
[{"$nulls":41},"Induction","Induction"]
[{"$nulls":41},"LED (Other)","LED_Lighting"]
[{"$nulls":41},"LED (ENERGY STAR)","LED_EnergyStar"]
[{"$nulls":41},"LED (DLC Outdoor)","LED_DLC_Outdoor"]
[{"$nulls":41},"LED (DLC Indoor)","LED_DLC_Indoor"]
[{"$nulls":41},"LED (DLC Outdoor Retrofit Kit)","LED_DLC_OutdoorRetrofitKit"]
[{"$nulls":41},"LED (DLC Indoor Retrofit Kit)","LED_DLC_IndoorRetrofitKit"]
[{"$nulls":41},"LED (DLC Linear Replacement Lamp)","LED_DLC_LinearReplacementLamp"]
[{"$nulls":41},"LED (DLC Mogul Screw-Base HID Replacement)","LED_DLC_MogulScrewBaseHidReplacement"]
[{"$nulls":41},"Mercury Vapor","MercuryVapor"]
[{"$nulls":41},"Metal Halide","MetalHalide"]
[{"$nulls":41},"Pulse Start Metal Halide","PulseStartMetalHalide"]
[{"$nulls":41},"Neon","Neon"]
[{"$nulls":41},"Other Lamp or Fixture","OtherLampOrFixture"]
[]
[]
[{"$nulls":41},"Additions to the Focus Input Wattage Guide needed for this calc are highlighted in yellow."]
[]
[{"$nulls":41},"Category","Description","Default Wattage","Orig T12 Watts","T8 Equivalent Description"]
[{"$nulls":41},"**Removed**","Baseline Fixture Removed and Not Replaced",0]
[{"$nulls":41},"Ceramic Metal Halide","39 watt CMH",46]
[{"$nulls":41},"Ceramic Metal Halide","50 watt CMH",55]
[{"$nulls":41},"Ceramic Metal Halide","60 watt CMH",67]
[{"$nulls":41},"Ceramic Metal Halide","90 watt CMH",99]
[{"$nulls":41},"Ceramic Metal Halide","140 watt CMH",154]
[{"$nulls":41},"Ceramic Metal Halide","150 watt CMH",185]
[{"$nulls":41},"Ceramic Metal Halide","210 watt CMH",229]
[{"$nulls":41},"Ceramic Metal Halide","220 watt CMH",242]
[{"$nulls":41},"Ceramic Metal Halide","270 watt CMH",290]
[{"$nulls":41},"Ceramic Metal Halide"," 315 watt CMH",343]
[{"$nulls":41},"Ceramic Metal Halide","575 watt CMH",640]
[{"$nulls":41},"CMH and PSMH Lamps","145 watt CMH Lamp",174]
[{"$nulls":41},"CMH and PSMH Lamps","150 watt CMH Lamp",180]
[{"$nulls":41},"CMH and PSMH Lamps","205 watt CMH Lamp",235]
[{"$nulls":41},"CMH and PSMH Lamps","220 watt CMH Lamp",242]
[{"$nulls":41},"CMH and PSMH Lamps","260 watt CMH Lamp",299]
[{"$nulls":41},"CMH and PSMH Lamps","330 watt CMH and PSMH Lamps",380]
[{"$nulls":41},"CMH and PSMH Lamps","360 watt MH Lamp",414]
[{"$nulls":41},"CMH and PSMH Lamps","830 watt CMH Lamp",896]
[{"$nulls":41},"CFL 2 Pin Based","10W CFL 2-Pin Base",15]
[{"$nulls":41},"CFL 2 Pin Based","16W CFL 2-Pin Base",22]
[{"$nulls":41},"CFL 2 Pin Based","21W CFL 2-Pin Base",24]
[{"$nulls":41},"CFL 2 Pin Based","28W CFL 2-Pin Base",32]
[{"$nulls":41},"CFL 2 Pin Based","38W CFL 2-Pin Base",39]
[{"$nulls":41},"CFL 4 Pin Based","5W CFL 4-Pin Base",9]
[{"$nulls":41},"CFL 4 Pin Based","7W CFL 4-Pin Base",10]
[{"$nulls":41},"CFL 4 Pin Based","9W CFL 4-Pin Base",13]
[{"$nulls":41},"CFL 4 Pin Based","10W CFL 4-Pin Base",15]
[{"$nulls":41},"CFL 4 Pin Based","13W CFL 4-Pin Base",16]
[{"$nulls":41},"CFL 4 Pin Based","14W CFL 4-Pin Base",18]
[{"$nulls":41},"CFL 4 Pin Based","15W CFL 4-Pin Base",20]
[{"$nulls":41},"CFL 4 Pin Based","16W CFL 4-Pin Base",22]
[{"$nulls":41},"CFL 4 Pin Based","17W CFL 4-Pin Base",24]
[{"$nulls":41},"CFL 4 Pin Based","18W CFL 4-Pin Base",23]
[{"$nulls":41},"CFL 4 Pin Based","20W CFL 4-Pin Base",23]
[{"$nulls":41},"CFL 4 Pin Based","21W CFL 4-Pin Base",24]
[{"$nulls":41},"CFL 4 Pin Based","22W CFL 4-Pin Base",26]
[{"$nulls":41},"CFL 4 Pin Based","23W CFL 4-Pin Base",27]
[{"$nulls":41},"CFL 4 Pin Based","24W CFL 4-Pin Base",32]
[{"$nulls":41},"CFL 4 Pin Based","25W CFL 4-Pin Base",33]
[{"$nulls":41},"CFL 4 Pin Based","26W CFL 4-Pin Base",31]
[{"$nulls":41},"CFL 4 Pin Based","27W CFL 4-Pin Base",29]
[{"$nulls":41},"CFL 4 Pin Based","28W CFL 4-Pin Base",33]
[{"$nulls":41},"CFL 4 Pin Based","32W CFL 4-Pin Base",35]
[{"$nulls":41},"CFL 4 Pin Based","33W CFL 4-Pin Base",35]
[{"$nulls":41},"CFL 4 Pin Based","36W CFL 4-Pin Base",51]
[{"$nulls":41},"CFL 4 Pin Based","38W CFL 4-Pin Base",40]
[{"$nulls":41},"CFL 4 Pin Based","40W CFL 4-Pin Base",48]
[{"$nulls":41},"CFL 4 Pin Based","42W CFL 4-Pin Base",46]
[{"$nulls":41},"CFL 4 Pin Based","55W CFL 4-Pin Base",58]
[{"$nulls":41},"CFL 4 Pin Based","57W CFL 4-Pin Base",59]
[{"$nulls":41},"CFL 4 Pin Based","70W CFL 4-Pin Base",73]
[{"$nulls":41},"CFL 4 Pin Based","85W CFL 4-Pin Base",96]
[{"$nulls":41},"CFL 4 Pin Based","120W CFL 4-Pin Base",135]
[{"$nulls":41},"CFL w/ Integral Ballast Screw or GU24","2W CFL Lamp",2]
[{"$nulls":41},"CFL w/ Integral Ballast Screw or GU24","4W CFL Lamp",4]
[{"$nulls":41},"CFL w/ Integral Ballast Screw or GU24","7W CFL Lamp",7]
[{"$nulls":41},"CFL w/ Integral Ballast Screw or GU24","9W CFL Lamp",9]
[{"$nulls":41},"CFL w/ Integral Ballast Screw or GU24","11W CFL Lamp",11]
[{"$nulls":41},"CFL w/ Integral Ballast Screw or GU24","13W CFL Lamp",16,"updated to match 2020 Lighting catalog"]
[{"$nulls":41},"CFL w/ Integral Ballast Screw or GU24","14W CFL Lamp",14]
[{"$nulls":41},"CFL w/ Integral Ballast Screw or GU24","15W CFL Lamp",15]
[{"$nulls":41},"CFL w/ Integral Ballast Screw or GU24","16W CFL Lamp",16]
[{"$nulls":41},"CFL w/ Integral Ballast Screw or GU24","17W CFL Lamp",17]
[{"$nulls":41},"CFL w/ Integral Ballast Screw or GU24","18W CFL Lamp",23,"updated to match 2020 Lighting catalog"]
[{"$nulls":41},"CFL w/ Integral Ballast Screw or GU24","20W CFL Lamp",20]
[{"$nulls":41},"CFL w/ Integral Ballast Screw or GU24","23W CFL Lamp",23]
[{"$nulls":41},"CFL w/ Integral Ballast Screw or GU24","25W CFL Lamp",25]
[{"$nulls":41},"CFL w/ Integral Ballast Screw or GU24","26W CFL Lamp",31,"updated to match 2020 Lighting catalog"]
[{"$nulls":41},"CFL w/ Integral Ballast Screw or GU24","27W CFL Lamp",27]
[{"$nulls":41},"CFL w/ Integral Ballast Screw or GU24","28W CFL Lamp",28]
[{"$nulls":41},"CFL w/ Integral Ballast Screw or GU24","32W CFL Lamp",35,"updated to match 2020 Lighting catalog"]
[{"$nulls":41},"CFL w/ Integral Ballast Screw or GU24","42W CFL Lamp",46,"updated to match 2020 Lighting catalog"]
[{"$nulls":41},"CFL w/ Integral Ballast Screw or GU24","44W CFL Lamp",44]
[{"$nulls":41},"CFL w/ Integral Ballast Screw or GU24","50W CFL Lamp",59]
[{"$nulls":41},"CFL w/ Integral Ballast Screw or GU24","70W CFL Lamp",83]
[{"$nulls":41},"CFL w/ Integral Ballast Screw or GU24","75W CFL Lamp",89]
[{"$nulls":41},"CFL w/ Integral Ballast Screw or GU24","100W CFL Lamp",112]
[{"$nulls":41},"CFL w/ Integral Ballast Screw or GU24","150W CFL Lamp",150]
[{"$nulls":41},"CFL w/ Integral Ballast Screw or GU24","200W CFL Lamp",200]
[{"$nulls":41},"Cold Cathode Screw Based Lamp","3W Cold Cathode",3]
[{"$nulls":41},"Cold Cathode Screw Based Lamp","4W Cold Cathode",4]
[{"$nulls":41},"Cold Cathode Screw Based Lamp","5W Cold Cathode",5]
[{"$nulls":41},"Cold Cathode Screw Based Lamp","8W Cold Cathode",8]
[{"$nulls":41},"Exit Signs","5w CFL Exit Sign (X1)",9]
[{"$nulls":41},"Exit Signs","5w CFL Exit Sign (X2)",20]
[{"$nulls":41},"Exit Signs","6w CFL Exit Sign (X1)",13]
[{"$nulls":41},"Exit Signs","6w CFL Exit Sign (X2)",26]
[{"$nulls":41},"Exit Signs","7w CFL Exit Sign (X1)",10]
[{"$nulls":41},"Exit Signs","7w CFL Exit Sign (X2)",21]
[{"$nulls":41},"Exit Signs","8w CFL Exit Sign (X1)",12]
[{"$nulls":41},"Exit Signs","8w CFL Exit Sign (X2)",24]
[{"$nulls":41},"Exit Signs","9w CFL Exit Sign (X1)",12]
[{"$nulls":41},"Exit Signs","9w CFL Exit Sign (X2)",20]
[{"$nulls":41},"Exit Signs","2 Watt LED Exit Sign  (X1)",2]
[{"$nulls":41},"Exit Signs","2 Watt LED Exit Sign  (X2)",4]
[{"$nulls":41},"Exit Signs","3 Watt LED Exit Sign  (X1)",3,"Equiv T8 Watts","T8 Equivalent Description (Focus wattage guide unless otherwise noted)"]
[{"$nulls":41},"Fluorescent - T12 1.5ft","1L 15W T12",20,20,"1L 15W T8"]
[{"$nulls":41},"Fluorescent - T12 1.5ft","2L 15W T12",39,38,"2L 15W T8"]
[{"$nulls":41},"Fluorescent - T12 and T12HO 2ft","1L F20 T12 ",23,20,"1L F17 T8 "]
[{"$nulls":41},"Fluorescent - T12 and T12HO 2ft","2L F20 T12 ",52,36,"2L F17 T8 "]
[{"$nulls":41},"Fluorescent - T12 and T12HO 2ft","3L F20 T12 ",68,52,"3L F17 T8 "]
[{"$nulls":41},"Fluorescent - T12 and T12HO 2ft","4L F20 T12 ",96,66,"4L F17 T8 "]
[{"$nulls":41},"Fluorescent - T12 and T12HO 2ft","6L F20 T12 ",146,102,"6L F17 T8 (estimated as a 4L T8 and 2L T8)"]
[{"$nulls":41},"Fluorescent - T12 and T12HO 2ft","1L F24 T12/HO (35w Lamps)",63,63,"Using T12HO wattage as placeholder"]
[{"$nulls":41},"Fluorescent - T12 and T12HO 2ft","2L F24 T12/HO (35w Lamps)",92,92,"Using T12HO wattage as placeholder"]
[{"$nulls":41},"Fluorescent - T12 and T12HO 3ft","1L F30 T12 /ES",31,27,"1L F25 T8"]
[{"$nulls":41},"Fluorescent - T12 and T12HO 3ft","2L F30 T12/ES",64,50,"2L F25 T8"]
[{"$nulls":41},"Fluorescent - T12 and T12HO 3ft","3L F30 T12/ES",98,73,"3L F25 T8"]
[{"$nulls":41},"Fluorescent - T12 and T12HO 3ft","4L F30 T12/ES",132,96,"4L F25 T8"]
[{"$nulls":41},"Fluorescent - T12 and T12HO 3ft","6L F30 T12/ES",198,135,"6L F25 T8"]
[{"$nulls":41},"Fluorescent - T12 and T12HO 3ft","1L F30 T12",39,27,"1L F25 T8"]
[{"$nulls":41},"Fluorescent - T12 and T12HO 3ft","2L F30 T12",70,50,"2L F25 T8"]
[{"$nulls":41},"Fluorescent - T12 and T12HO 3ft","3L F30 T12",110,73,"3L F25 T8"]
[{"$nulls":41},"Fluorescent - T12 and T12HO 3ft","4L F30 T12",144,96,"4L F25 T8"]
[{"$nulls":41},"Fluorescent - T12 and T12HO 3ft","6L F30 T12",225,135,"6L F25 T8"]
[{"$nulls":41},"Fluorescent - T12 and T12HO 3ft","1L F30 T12/HO (50w Lamps)",71,71,"Using T12HO wattage as placeholder"]
[{"$nulls":41},"Fluorescent - T12 and T12HO 3ft","2L F30 T12/HO (50w Lamps)",112,112,"Using T12HO wattage as placeholder"]
[{"$nulls":41},"Fluorescent - T12 and T12HO 4ft","1L F34 T12",39,33,"1L F32 T8"]
[{"$nulls":41},"Fluorescent - T12 and T12HO 4ft","2L F34 T12",66,61,"2L F32 T8"]
[{"$nulls":41},"Fluorescent - T12 and T12HO 4ft","3L F34 T12",103,91,"3L F32 T8"]
[{"$nulls":41},"Fluorescent - T12 and T12HO 4ft","4L F34 T12",136,120,"4L F32 T8"]
[{"$nulls":41},"Fluorescent - T12 and T12HO 4ft","1L F40 T12",39,33,"1L F32 T8"]
[{"$nulls":41},"Fluorescent - T12 and T12HO 4ft","2L F40 T12",79,61,"2L F32 T8"]
[{"$nulls":41},"Fluorescent - T12 and T12HO 4ft","3L F40 T12",124,91,"3L F32 T8"]
[{"$nulls":41},"Fluorescent - T12 and T12HO 4ft","4L F40 T12",153,120,"4L F32 T8"]
[{"$nulls":41},"Fluorescent - T12 and T12HO 4ft","6L F40 T12",186,174,"FLT8-32W x 6L x 4'-2 IS N from 2013 CenterPoint Energy Wattage Guide"]
[{"$nulls":41},"Fluorescent - T12 and T12HO 4ft","1L F40 T12/HO (60 watt Lamps)",76,76,"Using T12HO wattage as placeholder"]
[{"$nulls":41},"Fluorescent - T12 and T12HO 4ft","2L F40 T12/HO (60 watt Lamps)",134,134,"Using T12HO wattage as placeholder"]
[{"$nulls":41},"Fluorescent - T12 and T12HO 4ft","3L F40 T12/HO (60 watt Lamps)",217,217,"Using T12HO wattage as placeholder"]
[{"$nulls":41},"Fluorescent - T12 and T12HO 4ft","4L F40 T12/HO (60 watt Lamps)",276,276,"Using T12HO wattage as placeholder"]
[{"$nulls":41},"Fluorescent - T12 and T12HO 4ft","1L F40 T12/VHO (116w Lamps)",140,140,"Using T12HO wattage as placeholder"]
[{"$nulls":41},"Fluorescent - T12 and T12HO 4ft","2L F40 T12/VHO (116w Lamps)",252,252,"Using T12HO wattage as placeholder"]
[{"$nulls":41},"Fluorescent - T12 and T12HO 4ft","3L F40 T12/VHO (116w Lamps)",377,377,"Using T12HO wattage as placeholder"]
[{"$nulls":41},"Fluorescent - T12 and T12HO 4ft","4L F40 T12/VHO (116w Lamps)",484,484,"Using T12HO wattage as placeholder"]
[{"$nulls":41},"Fluorescent - T12 5ft","1L F60 T12 (50w Lamp)",54,36,"1L F40 T8"]
[{"$nulls":41},"Fluorescent - T12 5ft","2L F60 T12 (50w Lamp)",108,72,"2L F40 T8"]
[{"$nulls":41},"Fluorescent - T12 6ft","1L F72 T12 (57w Lamps)",73,51,"Xcel Energy wattage guide, avg. of 1L T8 6' mag and elec ballast"]
[{"$nulls":41},"Fluorescent - T12 6ft","2L F72 T12 (57w Lamps)",114,93,"Xcel Energy wattage guide, avg. of 2L T8 6' mag and elec ballast"]
[{"$nulls":41},"Fluorescent - T12 6ft","3L F72 T12 (57w Lamps)",189,144,"No data available, so used 1L + 2L 6' T8"]
[{"$nulls":41},"Fluorescent - T12 6ft","4L F72 T12 (57w Lamps)",230,185,"No data available, so used 2L + 2L 6' T8"]
[{"$nulls":41},"Fluorescent - T12 and T12HO 8ft","1L F96T12 (60w Lamps)",69,61,"1L F96T8 (59w Lamps)"]
[{"$nulls":41},"Fluorescent - T12 and T12HO 8ft","2L F96T12 (60w Lamps)",109,107,"2L F96T8 (59w Lamps)"]
[{"$nulls":41},"Fluorescent - T12 and T12HO 8ft","3L F96T12 (60w Lamps)",179,167,"3L F96T8 (59w Lamps)"]
[{"$nulls":41},"Fluorescent - T12 and T12HO 8ft","4L F96T12 (60w Lamps)",233,219,"4L F96T8 (59w Lamps)"]
[{"$nulls":41},"Fluorescent - T12 and T12HO 8ft","1L F96T12/HO (95w Lamps)",115,115,"Using T12HO wattage as placeholder"]
[{"$nulls":41},"Fluorescent - T12 and T12HO 8ft","2L F96T12/HO (95w Lamps)",190,190,"Using T12HO wattage as placeholder"]
[{"$nulls":41},"Fluorescent - T12 and T12HO 8ft","3L F96T12/HO (95w Lamps)",319,319,"Using T12HO wattage as placeholder"]
[{"$nulls":41},"Fluorescent - T12 and T12HO 8ft","4L F96T12/HO (95w Lamps)",414,414,"Using T12HO wattage as placeholder"]
[{"$nulls":41},"Fluorescent - T12 and T12HO 8ft","1L F96T12/VHO (185w Lamps)",202,202,"Using T12HO wattage as placeholder"]
[{"$nulls":41},"Fluorescent - T12 and T12HO 8ft","2L F96T12/VHO (185w Lamps)",389,389,"Using T12HO wattage as placeholder"]
[{"$nulls":41},"Fluorescent - T12 and T12HO 8ft","3L F96T12/VHO (185w Lamps)",568,568,"Using T12HO wattage as placeholder"]
[{"$nulls":41},"Fluorescent - T12 and T12HO 8ft","4L F96T12/VHO (185w Lamps)",760,760,"Using T12HO wattage as placeholder"]
[{"$nulls":41},"Fluorescent - T12 U-tube","1L FU40T12",43,29,"1L FU32T8"]
[{"$nulls":41},"Fluorescent - T12 U-tube","2L FU40T12",72,55,"2L FU32T8"]
[{"$nulls":41},"Fluorescent - T12 U-tube","3L FU40T12",115,81,"3L FU32T8"]
[{"$nulls":41},"Fluorescent - T5 and T5HO 2ft","1L F14T5",16]
[{"$nulls":41},"Fluorescent - T5 and T5HO 2ft","2L F14T5",31]
[{"$nulls":41},"Fluorescent - T5 and T5HO 2ft","3L F14T5",51]
[{"$nulls":41},"Fluorescent - T5 and T5HO 2ft","4L F14T5",66]
[{"$nulls":41},"Fluorescent - T5 and T5HO 2ft","1L F24T5/HO ",27]
[{"$nulls":41},"Fluorescent - T5 and T5HO 2ft","2L F24T5/HO ",53]
[{"$nulls":41},"Fluorescent - T5 and T5HO 2ft","3L F24T5/HO ",80]
[{"$nulls":41},"Fluorescent - T5 and T5HO 2ft","4L F24T5/HO ",105]
[{"$nulls":41},"Fluorescent - T5 and T5HO 2ft","6L F24T5/HO ",160]
[{"$nulls":41},"Fluorescent - T5 and T5HO 3ft","1L F21T5",25]
[{"$nulls":41},"Fluorescent - T5 and T5HO 3ft","2L F21T5",48]
[{"$nulls":41},"Fluorescent - T5 and T5HO 3ft","3L F21T5",73]
[{"$nulls":41},"Fluorescent - T5 and T5HO 3ft","4L F21T5",96]
[{"$nulls":41},"Fluorescent - T5 and T5HO 3ft","1L F39T5/HO",43]
[{"$nulls":41},"Fluorescent - T5 and T5HO 3ft","2L F39T5/HO",86]
[{"$nulls":41},"Fluorescent - T5 and T5HO 3ft","3L F39T5/HO",130]
[{"$nulls":41},"Fluorescent - T5 and T5HO 3ft","4L F39T5/HO",172]
[{"$nulls":41},"Fluorescent - T5 and T5HO 4ft","1L F28 T5",33]
[{"$nulls":41},"Fluorescent - T5 and T5HO 4ft","2L F28 T5",63]
[{"$nulls":41},"Fluorescent - T5 and T5HO 4ft","3L F28 T5",96]
[{"$nulls":41},"Fluorescent - T5 and T5HO 4ft","4L F28 T5",126]
[{"$nulls":41},"Fluorescent - T5 and T5HO 4ft","1L F54 T5HO",62]
[{"$nulls":41},"Fluorescent - T5 and T5HO 4ft","2L F54 T5HO",117]
[{"$nulls":41},"Fluorescent - T5 and T5HO 4ft","3L F54 T5HO",179]
[{"$nulls":41},"Fluorescent - T5 and T5HO 4ft","4L F54 T5HO HB",234]
[{"$nulls":41},"Fluorescent - T5 and T5HO 4ft","6L F54 T5HO HB",355]
[{"$nulls":41},"Fluorescent - T5 and T5HO 4ft","8L F54 T5HO HB",468]
[{"$nulls":41},"Fluorescent - T5 and T5HO 4ft","10L F54 T5HO HB",585]
[{"$nulls":41},"Fluorescent - T5 and T5HO 4ft","26 watt T5 Lamp",26]
[{"$nulls":41},"Fluorescent - T5 and T5HO 4ft","28 watt T5 Lamp",28]
[{"$nulls":41},"Fluorescent - T5 and T5HO 4ft","44 watt T5HO Lamp",44]
[{"$nulls":41},"Fluorescent - T5 and T5HO 4ft","47 watt T5HO Lamp",47]
[{"$nulls":41},"Fluorescent - T5 and T5HO 4ft","49 watt T5HO Lamp",49]
[{"$nulls":41},"Fluorescent - T5 and T5HO 4ft","51 watt T5HO Lamp",51]
[{"$nulls":41},"Fluorescent - T5 and T5HO 4ft","54 watt T5HO Lamp",54]
[{"$nulls":41},"Fluorescent - T8 1.5ft","1L 15W T8",20]
[{"$nulls":41},"Fluorescent - T8 1.5ft","2L 15W T8",38]
[{"$nulls":41},"Fluorescent - T8 2ft","1L F17 T8 ",20]
[{"$nulls":41},"Fluorescent - T8 2ft","2L F17 T8 ",36]
[{"$nulls":41},"Fluorescent - T8 2ft","3L F17 T8 ",52]
[{"$nulls":41},"Fluorescent - T8 2ft","4L F17 T8 ",66]
[{"$nulls":41},"Fluorescent - T8 3ft","1L F25 T8 3 ft",27]
[{"$nulls":41},"Fluorescent - T8 3ft","2L F25 T8 3 ft",50]
[{"$nulls":41},"Fluorescent - T8 3ft","3L F25 T8 3 ft",73]
[{"$nulls":41},"Fluorescent - T8 3ft","4L F25 T8 3 ft",96]
[{"$nulls":41},"Fluorescent - T8 3ft","6L F25 T8 3 ft",135]
[{"$nulls":41},"Fluorescent - T8 4ft","1L F32 T8 Low BF",26]
[{"$nulls":41},"Fluorescent - T8 4ft","2L F32 T8 Low BF",52]
[{"$nulls":41},"Fluorescent - T8 4ft","3L F32 T8 Low BF",78]
[{"$nulls":41},"Fluorescent - T8 4ft","4L F32 T8 Low BF",104]
[{"$nulls":41},"Fluorescent - T8 4ft","1L F32 T8 Normal BF",33]
[{"$nulls":41},"Fluorescent - T8 4ft","2L F32 T8 Normal BF",61]
[{"$nulls":41},"Fluorescent - T8 4ft","3L F32 T8 Normal BF",91]
[{"$nulls":41},"Fluorescent - T8 4ft","4L F32 T8 Normal BF",120]
[{"$nulls":41},"Fluorescent - T8 4ft","1L F32 T8 High BF",39]
[{"$nulls":41},"Fluorescent - T8 4ft","2L F32 T8 High BF",77]
[{"$nulls":41},"Fluorescent - T8 4ft","3L F32 T8 High BF",115]
[{"$nulls":41},"Fluorescent - T8 4ft","4L F32 T8 High BF",151]
[{"$nulls":41},"Fluorescent - T8 4ft","4L F32 T8 HB",151]
[{"$nulls":41},"Fluorescent - T8 4ft","6L F32 T8 HB",224]
[{"$nulls":41},"Fluorescent - T8 4ft","8L F32 T8 HB",291]
[{"$nulls":41},"Fluorescent - T8 4ft","10L F32 T8 HB",368]
[{"$nulls":41},"Fluorescent - T8 4ft (Std ballast, RW lamps)","1L F25 T8",25]
[{"$nulls":41},"Fluorescent - T8 4ft (Std ballast, RW lamps)","2L F25 T8",45]
[{"$nulls":41},"Fluorescent - T8 4ft (Std ballast, RW lamps)","3L F25 T8",65]
[{"$nulls":41},"Fluorescent - T8 4ft (Std ballast, RW lamps)","4L F25 T8",86]
[{"$nulls":41},"Fluorescent - T8 4ft (Std ballast, RW lamps)","4L F25 T8 HB",123]
[{"$nulls":41},"Fluorescent - T8 4ft (Std ballast, RW lamps)","1L F28 T8",26]
[{"$nulls":41},"Fluorescent - T8 4ft (Std ballast, RW lamps)","2L F28 T8",50]
[{"$nulls":41},"Fluorescent - T8 4ft (Std ballast, RW lamps)","3L F28 T8",74]
[{"$nulls":41},"Fluorescent - T8 4ft (Std ballast, RW lamps)","4L F28 T8",98]
[{"$nulls":41},"Fluorescent - T8 4ft (Std ballast, RW lamps)","4L F28 T8 HB",130]
[{"$nulls":41},"Fluorescent - T8 4ft (Std ballast, RW lamps)","6L F28 T8 HB",194]
[{"$nulls":41},"Fluorescent - T8 4ft (Std ballast, RW lamps)","1L F30 T8",30]
[{"$nulls":41},"Fluorescent - T8 4ft (Std ballast, RW lamps)","2L F30 T8",64]
[{"$nulls":41},"Fluorescent - T8 4ft (Std ballast, RW lamps)","3L F30 T8",79]
[{"$nulls":41},"Fluorescent - T8 4ft (Std ballast, RW lamps)","4L F30 T8",105]
[{"$nulls":41},"Fluorescent - CEE HPT8 4ft","1L F32 HPT8 (Low)",27]
[{"$nulls":41},"Fluorescent - CEE HPT8 4ft","2L F32 HPT8 (Low)",48]
[{"$nulls":41},"Fluorescent - CEE HPT8 4ft","3L F32 HPT8 (Low)",72]
[{"$nulls":41},"Fluorescent - CEE HPT8 4ft","4L F32 HPT8 (Low)",95]
[{"$nulls":41},"Fluorescent - CEE HPT8 4ft","1L F32 HPT8 (Normal)",28]
[{"$nulls":41},"Fluorescent - CEE HPT8 4ft","2L F32 HPT8 (Normal)",55]
[{"$nulls":41},"Fluorescent - CEE HPT8 4ft","3L F32 HPT8 (Normal)",82]
[{"$nulls":41},"Fluorescent - CEE HPT8 4ft","4L F32 HPT8 (Normal)",108]
[{"$nulls":41},"Fluorescent - CEE HPT8 4ft","1L F32 HPT8 (High)",37]
[{"$nulls":41},"Fluorescent - CEE HPT8 4ft","2L F32 HPT8 (High)",74]
[{"$nulls":41},"Fluorescent - CEE HPT8 4ft","3L F32 HPT8 (High)",109]
[{"$nulls":41},"Fluorescent - CEE HPT8 4ft","4L F32 HPT8 (High)",145]
[{"$nulls":41},"Fluorescent - CEE RWT8 4ft","1L F32 RWT8 (Low) (28w Lamps)",22]
[{"$nulls":41},"Fluorescent - CEE RWT8 4ft","2L F32 RWT8 (Low) (28w Lamps)",43]
[{"$nulls":41},"Fluorescent - CEE RWT8 4ft","3L F32 RWT8 (Low) (28w Lamps)",63]
[{"$nulls":41},"Fluorescent - CEE RWT8 4ft","4L F32 RWT8 (Low) (28w Lamps)",83]
[{"$nulls":41},"Fluorescent - CEE RWT8 4ft","1L F32 RWT8 (Normal) (28w Lamps)",25]
[{"$nulls":41},"Fluorescent - CEE RWT8 4ft","2L F32 RWT8 (Normal) (28w Lamps)",48]
[{"$nulls":41},"Fluorescent - CEE RWT8 4ft","3L F32 RWT8 (Normal) (28w Lamps)",72]
[{"$nulls":41},"Fluorescent - CEE RWT8 4ft","4L F32 RWT8 (Normal) (28w Lamps)",94]
[{"$nulls":41},"Fluorescent - CEE RWT8 4ft","1L F32 RWT8 (High) (28w Lamps)",33]
[{"$nulls":41},"Fluorescent - CEE RWT8 4ft","2L F32 RWT8 (High) (28w Lamps)",65]
[{"$nulls":41},"Fluorescent - CEE RWT8 4ft","3L F32 RWT8 (High) (28w Lamps)",96]
[{"$nulls":41},"Fluorescent - CEE RWT8 4ft","4L F32 RWT8 (High) (28w Lamps)",131]
[{"$nulls":41},"Fluorescent - CEE RWT8 4ft","1L F32 RWT8 (Low) (25w Lamps)",21]
[{"$nulls":41},"Fluorescent - CEE RWT8 4ft","2L F32 RWT8 (Low) (25w Lamps)",38]
[{"$nulls":41},"Fluorescent - CEE RWT8 4ft","3L F32 RWT8 (Low) (25w Lamps)",57]
[{"$nulls":41},"Fluorescent - CEE RWT8 4ft","4L F32 RWT8 (Low) (25w Lamps)",75]
[{"$nulls":41},"Fluorescent - CEE RWT8 4ft","1L F32 RWT8 (Normal) (25w Lamps)",23]
[{"$nulls":41},"Fluorescent - CEE RWT8 4ft","2L F32 RWT8 (Normal) (25w Lamps)",43]
[{"$nulls":41},"Fluorescent - CEE RWT8 4ft","3L F32 RWT8 (Normal) (25w Lamps)",64]
[{"$nulls":41},"Fluorescent - CEE RWT8 4ft","4L F32 RWT8 (Normal) (25w Lamps)",85]
[{"$nulls":41},"Fluorescent - CEE RWT8 4ft","1L F32 RWT8 (High) (25w Lamps)",31]
[{"$nulls":41},"Fluorescent - CEE RWT8 4ft","2L F32 RWT8 (High) (25w Lamps)",60]
[{"$nulls":41},"Fluorescent - CEE RWT8 4ft","3L F32 RWT8 (High) (25w Lamps)",93]
[{"$nulls":41},"Fluorescent - CEE RWT8 4ft","4L F32 RWT8 (High) (25w Lamps)",122]
[{"$nulls":41},"Fluorescent - T8 5ft","1L F40 T8",36]
[{"$nulls":41},"Fluorescent - T8 5ft","2L F40 T8",72]
[{"$nulls":41},"Fluorescent - T8 5ft","3L F40 T8",106]
[{"$nulls":41},"Fluorescent - T8 5ft","4L F40 T8",134]
[{"$nulls":41},"Fluorescent - T8 8ft","1L F96T8 (57watt Lamps)",51]
[{"$nulls":41},"Fluorescent - T8 8ft","1L F96T8 (59watt Lamps)",61]
[{"$nulls":41},"Fluorescent - T8 8ft","2L F96T8 (57watt Lamps)",100]
[{"$nulls":41},"Fluorescent - T8 8ft","2L F96T8 (59watt Lamps)",107]
[{"$nulls":41},"Fluorescent - T8 8ft","3L F96T8 (59watt Lamps)",167]
[{"$nulls":41},"Fluorescent - T8 8ft","4L F96T8 (59watt Lamps)",219]
[{"$nulls":41},"Fluorescent - T8 U-tube","1L FU32T8/6",29]
[{"$nulls":41},"Fluorescent - T8 U-tube","2L FU32T8/6",55]
[{"$nulls":41},"Fluorescent - T8 U-tube","3L FU32T8/6",81]
[{"$nulls":41},"Fluorescent - T8 4ft Lamp Only","25 watt Lamp",22]
[{"$nulls":41},"Fluorescent - T8 4ft Lamp Only","28 watt Lamp",25]
[{"$nulls":41},"Fluorescent - T8 4ft Lamp Only","30 watt Lamp",26]
[{"$nulls":41},"Fluorescent - T8 4ft Lamp Only","32 watt Lamp",28]
[{"$nulls":41},"Fluorescent - T8 8ft Lamp Only","49 watt Lamp",43]
[{"$nulls":41},"Fluorescent - T8 8ft Lamp Only","50 watt Lamp",44]
[{"$nulls":41},"Fluorescent - T8 8ft Lamp Only","51 watt Lamp",45]
[{"$nulls":41},"Fluorescent - T8 8ft Lamp Only","54 watt Lamp",48]
[{"$nulls":41},"Fluorescent - T8 8ft Lamp Only","59 watt Lamp",52]
[{"$nulls":41},"High Pressure Sodium","35 watt HPS",45]
[{"$nulls":41},"High Pressure Sodium","50 watt HPS",65]
[{"$nulls":41},"High Pressure Sodium","70 watt HPS",94,"updated to match 2020 Lighting catalog"]
[{"$nulls":41},"High Pressure Sodium","100 watt HPS",126,"updated to match 2020 Lighting catalog"]
[{"$nulls":41},"High Pressure Sodium","150 watt HPS",179,"updated to match 2020 Lighting catalog"]
[{"$nulls":41},"High Pressure Sodium","200 watt HPS",245]
[{"$nulls":41},"High Pressure Sodium","250 watt HPS",293,"updated to match 2020 Lighting catalog"]
[{"$nulls":41},"High Pressure Sodium","310 watt HPS",365]
[{"$nulls":41},"High Pressure Sodium","360 watt HPS",414]
[{"$nulls":41},"High Pressure Sodium","400 watt HPS",455,"updated to match 2020 Lighting catalog"]
[{"$nulls":41},"High Pressure Sodium","600 watt HPS",665]
[{"$nulls":41},"High Pressure Sodium","750 watt HPS",840]
[{"$nulls":41},"High Pressure Sodium","1000 watt HPS",1079,"updated to match 2020 Lighting catalog"]
[{"$nulls":41},"Incandescent","15W Incandescent",15]
[{"$nulls":41},"Incandescent","25W Incandescent",25]
[{"$nulls":41},"Incandescent","40W Incandescent",40]
[{"$nulls":41},"Incandescent","55W Incandescent",55]
[{"$nulls":41},"Incandescent","60W Incandescent",60]
[{"$nulls":41},"Incandescent","65W Incandescent",65]
[{"$nulls":41},"Incandescent","75W Incandescent",75]
[{"$nulls":41},"Incandescent","100W Incandescent",100]
[{"$nulls":41},"Incandescent","150W Incandescent",150]
[{"$nulls":41},"Incandescent","Other Incandescent","Enter Watts"]
[{"$nulls":41},"Induction","35 watt Induction Fixture",39]
[{"$nulls":41},"Induction","55 watt Induction Fixture",58]
[{"$nulls":41},"Induction","70 watt Induction Fixture",77]
[{"$nulls":41},"Induction","85 watt Induction Fixture",90]
[{"$nulls":41},"Induction","100 watt Induction Fixture",107]
[{"$nulls":41},"Induction","120 watt Induction Fixture",132]
[{"$nulls":41},"Induction","125 watt Induction Fixture",138]
[{"$nulls":41},"Induction","150 watt Induction Fixture",161]
[{"$nulls":41},"Induction","165 watt Induction Fixture",174]
[{"$nulls":41},"Induction","200 watt Induction Fixture",220]
[{"$nulls":41},"Induction","225 watt Induction Fixture",248]
[{"$nulls":41},"Induction","250 watt Induction Fixture",275]
[{"$nulls":41},"Induction","300 watt lnduction Fixture",330]
[{"$nulls":41},"Induction","750 watt lnduction Fixture",825]
[{"$nulls":41},"LED (Other)","LED (Other)","Enter Watts"]
[{"$nulls":41},"LED (ENERGY STAR)","LED (ENERGY STAR Lamps)","Enter Watts"]
[{"$nulls":41},"LED (ENERGY STAR)","LED (ENERGY STAR Fixtures)","Enter Watts"]
[{"$nulls":41},"LED (DLC Outdoor)","LED (DLC Outdoor Pole/Arm-mounted Area & Roadway Luminaires)","Enter Watts"]
[{"$nulls":41},"LED (DLC Outdoor)","LED (DLC Outdoor Pole/Arm-mounted Decorative Luminaires)","Enter Watts"]
[{"$nulls":41},"LED (DLC Outdoor)","LED (DLC Outdoor Full-Cutoff Wall-mounted Area Luminaires)","Enter Watts"]
[{"$nulls":41},"LED (DLC Outdoor)","LED (DLC Outdoor Non-Cutoff & Semi-Cutoff Wall-mounted Area Luminaires)","Enter Watts"]
[{"$nulls":41},"LED (DLC Outdoor)","LED (DLC Bollards)","Enter Watts"]
[{"$nulls":41},"LED (DLC Outdoor)","LED (DLC Parking Garage Luminaires)","Enter Watts"]
[{"$nulls":41},"LED (DLC Outdoor)","LED (DLC Fuel Pump Canopy Luminaires)","Enter Watts"]
[{"$nulls":41},"LED (DLC Outdoor)","LED (DLC L&scape/Accent Flood & Spot Luminaires)","Enter Watts"]
[{"$nulls":41},"LED (DLC Outdoor)","LED (DLC Architectural Flood & Spot Luminaires)","Enter Watts"]
[{"$nulls":41},"LED (DLC Outdoor)","LED (DLC Stairwell & Passageway Luminaires)","Enter Watts"]
[{"$nulls":41},"LED (DLC Indoor)","LED (DLC Wall-wash Luminaires)","Enter Watts"]
[{"$nulls":41},"LED (DLC Indoor)","LED (DLC Track or Mono-point Directional Luminaires)","Enter Watts"]
[{"$nulls":41},"LED (DLC Indoor)","LED (DLC Vertical Refrigerated Case Luminaires-center)","Enter Watts"]
[{"$nulls":41},"LED (DLC Indoor)","LED (DLC Vertical Refrigerated Case Luminaires-end)","Enter Watts"]
[{"$nulls":41},"LED (DLC Indoor)","LED (DLC Horizontal Refrigerated Case Luminaires)","Enter Watts"]
[{"$nulls":41},"LED (DLC Indoor)","LED (DLC Display Case Luminaires)","Enter Watts"]
[{"$nulls":41},"LED (DLC Indoor)","LED (DLC 2x2 Luminaires-Ambient Lighting of Interior Comm. Spaces)","Enter Watts"]
[{"$nulls":41},"LED (DLC Indoor)","LED (DLC 1x4 Luminaires-Ambient Lighting of Interior Comm. Spaces)","Enter Watts"]
[{"$nulls":41},"LED (DLC Indoor)","LED (DLC 2x4 Luminaires-Ambient Lighting of Interior Comm. Spaces)","Enter Watts"]
[{"$nulls":41},"LED (DLC Indoor)","LED (DLC Linear Ambient Luminaires w/ Indirect Component)","Enter Watts"]
[{"$nulls":41},"LED (DLC Indoor)","LED (DLC Direct Linear Ambient Luminaires)","Enter Watts"]
[{"$nulls":41},"LED (DLC Indoor)","LED (DLC High-bay Luminaires for C&I Buildings)","Enter Watts"]
[{"$nulls":41},"LED (DLC Indoor)","LED (DLC Low-bay Luminaires for C&I Buildings)","Enter Watts"]
[{"$nulls":41},"LED (DLC Indoor)","LED (DLC High-bay Aisle Luminaires)","Enter Watts"]
[{"$nulls":41},"LED (DLC Outdoor Retrofit Kit)","LED (DLC Retrofit Kits-Outdoor Pole/Arm-mounted Area & Roadway Luminaires)","Enter Watts"]
[{"$nulls":41},"LED (DLC Outdoor Retrofit Kit)","LED (DLC Retrofit Kits-Outdoor Pole/Arm-mounted Decorative Luminaires)","Enter Watts"]
[{"$nulls":41},"LED (DLC Outdoor Retrofit Kit)","LED (DLC Retrofit Kits-Large Outdoor Pole/Arm-mounted Area & Roadway Luminaires)","Enter Watts"]
[{"$nulls":41},"LED (DLC Outdoor Retrofit Kit)","LED (DLC Retrofit Kits-Full-Cutoff Outdoor Wall-mounted Area Luminaires)","Enter Watts"]
[{"$nulls":41},"LED (DLC Outdoor Retrofit Kit)","LED (DLC Retrofit Kits-Parking Garage Luminaires)","Enter Watts"]
[{"$nulls":41},"LED (DLC Outdoor Retrofit Kit)","LED (DLC Retrofit Kits-Fuel Pump Canopy Luminaires)","Enter Watts"]
[{"$nulls":41},"LED (DLC Indoor Retrofit Kit)","LED (DLC Retrofit Kits-2x2 Luminaires-Ambient Lighting of Interior Comm. Spaces )","Enter Watts"]
[{"$nulls":41},"LED (DLC Indoor Retrofit Kit)","LED (DLC Retrofit Kits-1x4 Luminaires-Ambient Lighting of Interior Comm. Spaces )","Enter Watts"]
[{"$nulls":41},"LED (DLC Indoor Retrofit Kit)","LED (DLC Retrofit Kits-2x4 Luminaires-Ambient Lighting of Interior Comm. Spaces )","Enter Watts"]
[{"$nulls":41},"LED (DLC Indoor Retrofit Kit)","LED (DLC Retrofit Kits-Direct Linear Ambient Luminaires)","Enter Watts"]
[{"$nulls":41},"LED (DLC Indoor Retrofit Kit)","LED (DLC Retrofit Kits-High-bay Luminaires-C&I Buildings)","Enter Watts"]
[{"$nulls":41},"LED (DLC Indoor Retrofit Kit)","LED (DLC Retrofit Kits-Low-bay Luminaires-C&I Buildings)","Enter Watts"]
[{"$nulls":41},"LED (DLC Linear Replacement Lamp)","LED (DLC Four-foot Linear Replacement Lamps )","Enter Watts"]
[{"$nulls":41},"LED (DLC Linear Replacement Lamp)","LED (DLC Two-foot Linear Replacement Lamps )","Enter Watts"]
[{"$nulls":41},"LED (DLC Mogul Screw-Base HID Replacement)","LED (DLC Screw-base HID Lamp Replacement-Outdoor Pole/Arm-mounted Area & Roadway Luminaires)","Enter Watts"]
[{"$nulls":41},"LED (DLC Mogul Screw-Base HID Replacement)","LED (DLC Screw-base HID Lamp Replacement-Outdoor Pole/Arm-mounted Decorative Luminaires)","Enter Watts"]
[{"$nulls":41},"LED (DLC Mogul Screw-Base HID Replacement)","LED (DLC Screw-base HID Lamp Replacement-Outdoor Full Cut-off Wall-mounted Area Luminaires)","Enter Watts"]
[{"$nulls":41},"LED (DLC Mogul Screw-Base HID Replacement)","LED (DLC Screw-base HID Lamp Replacement-Parking Garage Luminaires)","Enter Watts"]
[{"$nulls":41},"LED (DLC Mogul Screw-Base HID Replacement)","LED (DLC Screw-base HID Lamp Replacement-Fuel Pump Canopy Luminaires)","Enter Watts"]
[{"$nulls":41},"LED (DLC Mogul Screw-Base HID Replacement)","LED (DLC Screw-base HID Lamp Replacement-High-bay Luminaires-C&I Buildings)","Enter Watts"]
[{"$nulls":41},"LED (DLC Mogul Screw-Base HID Replacement)","LED (DLC Screw-base HID Lamp Replacement-Low-bay Luminaires-C&I Buildings)","Enter Watts"]
[{"$nulls":41},"Mercury Vapor","40 watt MV",50]
[{"$nulls":41},"Mercury Vapor","50 watt MV",75]
[{"$nulls":41},"Mercury Vapor","75 watt MV",94]
[{"$nulls":41},"Mercury Vapor","100 watt MV",124]
[{"$nulls":41},"Mercury Vapor","175 watt MV",205]
[{"$nulls":41},"Mercury Vapor","250 watt MV",288]
[{"$nulls":41},"Mercury Vapor","400 watt MV",455]
[{"$nulls":41},"Mercury Vapor","1000 watt MV",1079]
[{"$nulls":41},"Metal Halide","20/22 watt MH",25]
[{"$nulls":41},"Metal Halide","32 watt MH",40]
[{"$nulls":41},"Metal Halide","35/39 watt MH",52]
[{"$nulls":41},"Metal Halide","50 watt MH",65]
[{"$nulls":41},"Metal Halide","70 watt MH",94]
[{"$nulls":41},"Metal Halide","100 watt MH",126]
[{"$nulls":41},"Metal Halide","150 watt MH",179]
[{"$nulls":41},"Metal Halide","175 watt MH",210]
[{"$nulls":41},"Metal Halide","200 watt MH",232]
[{"$nulls":41},"Metal Halide","250 watt MH",293]
[{"$nulls":41},"Metal Halide","400 watt MH",455]
[{"$nulls":41},"Metal Halide","1000 watt MH",1079]
[{"$nulls":41},"Metal Halide","1500 watt MH",1609]
[{"$nulls":41},"Metal Halide","1650 watt MH",1765]
[{"$nulls":41},"Metal Halide","2000 watt MH",2140]
[{"$nulls":41},"Pulse Start Metal Halide","50 watt PSMH",67]
[{"$nulls":41},"Pulse Start Metal Halide","70 watt PSMH",88]
[{"$nulls":41},"Pulse Start Metal Halide","100 watt PSMH",123]
[{"$nulls":41},"Pulse Start Metal Halide","125 watt PSMH",146]
[{"$nulls":41},"Pulse Start Metal Halide","150 watt PSMH",181]
[{"$nulls":41},"Pulse Start Metal Halide","175 watt PSMH",199]
[{"$nulls":41},"Pulse Start Metal Halide","200 watt PSMH",225]
[{"$nulls":41},"Pulse Start Metal Halide","250 watt PSMH",281]
[{"$nulls":41},"Pulse Start Metal Halide","320 watt PSMH",356]
[{"$nulls":41},"Pulse Start Metal Halide","350 watt PSMH",393]
[{"$nulls":41},"Pulse Start Metal Halide","400 watt PSMH",445]
[{"$nulls":41},"Pulse Start Metal Halide","450 watt PSMH",493]
[{"$nulls":41},"Pulse Start Metal Halide"," 750 watt PSMH",812]
[{"$nulls":41},"Pulse Start Metal Halide","775 watt PSMH",855]
[{"$nulls":41},"Pulse Start Metal Halide","875 watt PSMH",950]
[{"$nulls":41},"Pulse Start Metal Halide","1000 watt PSMH",1079]
[{"$nulls":41},"Neon","9mm Neon",15]
[{"$nulls":41},"Neon","10mm Neon",13]
[{"$nulls":41},"Neon","11mm Neon",10]
[{"$nulls":41},"Neon","12mm Neon",8]
[{"$nulls":41},"Neon","13mm Neon",7]
[{"$nulls":41},"Neon","14mm Neon",7]
[{"$nulls":41},"Neon","15mm Neon",7]
[{"$nulls":41},"Neon","18mm Neon",6]
[{"$nulls":41},"Neon","20mm Neon",5]
[{"$nulls":41},"Neon","22mm Neon",4]
[{"$nulls":41},"Neon","25mm Neon",3]
[{"$nulls":41},"Other Lamp or Fixture","None",0]
[{"$nulls":41},"Other Lamp or Fixture","Other (Describe)","Enter Watts"]

{"sheet":"QPLs","index":3,"n_rows":26,"n_cols":16,"rows_kept":26}
["Insert/Embed Equipment and Controls DLC QPLs"]
[{"$nulls":6},"How to Embed a PDF File in an Excel Worksheet"]
[{"$nulls":6},"1. Go to Insert tab and click on the Object icon in the Text group. ..."]
[{"$nulls":6},"2. In the Object dialog box, select the 'Create New' tab and the select 'Adobe Acrobat Document' from the list. ..."]
[{"$nulls":6},"3. Check the option – 'Display as icon'."]
[{"$nulls":6},"4. If desired, select \"Change Icon\" to modify the file name displayed (ex: Model XYZ QPL, Model ABC QPL, etc.).  "]
[{"$nulls":6},"5. Click OK."]
[{"$nulls":6},"6. Select the PDF file to embed and click on Open."]
[]
[{"$nulls":6},"1)",{"$nulls":8},"2 - 5)"]
{"$rows_empty":15}
[{"$nulls":15},"6)"]

{"sheet":"Invoice_Optional","index":4,"n_rows":1,"n_cols":1,"rows_kept":1,"hidden":true}
["Insert/Embed Invoice **Optional**"]

{"sheet":"Savings and Incentives","index":5,"n_rows":55,"n_cols":17,"rows_kept":55,"merged":[[2,5,2,6],[3,1,3,3],[4,1,4,3],[5,1,5,3],[6,1,6,3],[6,5,10,5],[7,1,7,3],[8,1,8,3],[10,1,10,3],[11,1,11,3],[12,1,12,3],[13,1,13,3],[14,0,14,4],[16,1,16,3],[17,1,17,3],[47,1,47,5],[48,1,48,3],[48,4,48,5],[49,1,49,3],[50,1,50,2],[51,1,53,1],[53,4,53,5],[54,1,54,2]]}
[{"$nulls":5},"Last Updated: ",{"$f":"MAX('Version History'!$B$5:$B$40)","v":"2023-03-09"}]
["section 6","Additional Information"]
[]
[null,"L5029: CLS - Fixture or Retrofit Kit Only"]
[null,"L5031: CLS - Fixture or Retrofit Kit/Lamp with Connected Controls, Interior"]
[null,"L5030: CLS - Fixture or Retrofit Kit/Lamp with Connected Controls, Exterior"]
[]
[]
[null,"SECTOR (Choose from dropdown)"]
[]
[]
[null,"EXISTING AVERAGE FOOTCANDLES*"]
[]
[null,"PROPOSED AVERAGE FOOTCANDLES*"]
["*Footcandles (either measured or calculated) at working surface for space type with largest square footage"]
[]
[]
[null,"ESTIMATED COMPLETION DATE"]
[]
[]
["section 7","Energy Savings  (If TA calc used, paste or link savings values from calc tab)"]
[null,null,"L5029","L5031","L5030"]
[null,"Annual kW Savings",{"$f":"Calculations!K1027","v":0},{"$f":"Calculations!K1028","v":0},{"$f":"Calculations!K1029","v":0}]
[null,"Annual kWh Savings",{"$f":"Calculations!L1027","v":0},{"$f":"Calculations!L1028","v":0},{"$f":"Calculations!L1029","v":0}]
[null,"Lifecycle kWh Savings",{"$f":"Calculations!M1027","v":0},{"$f":"Calculations!M1028","v":0},{"$f":"Calculations!M1029","v":0}]
[]
[{"$nulls":13},"CLS - Fixture or Retrofit Kit Only ",null,null,0.25]
[{"$nulls":13},"CLS - Fixture or Retrofit Kit/Lamp with Connected Controls, Interior",null,null,0.45]
["section 8","Estimated Incentive Amount (If TA calc used, paste or link watts reduced values from calc tab)",{"$nulls":11},"CLS - Fixture or Retrofit Kit/Lamp with Connected Controls, Exterior",null,null,0.5]
[]
[null,null,"L5029","L5031","L5030"]
[null,"Project Cost",{"$f":"SUMIF(Calculations!AD20:AD1019, \"L5029\", Calculations!AG20:AG1019)","v":0},{"$f":"SUMIF(Calculations!AD20:AD1019, \"L5031\", Calculations!AG20:AG1019)","v":0},{"$f":"SUMIF(Calculations!AD20:AD1019, \"L5030\", Calculations!AG20:AG1019)","v":0}]
[null,"Incentive Rate ($/Watt Reduced)",{"v":0.25,"d":"$0.25"},{"v":0.45,"d":"$0.45"},{"v":0.5,"d":"$0.50"}]
[null,"Watts Reduced",{"$f":"Calculations!R1027","v":0},{"$f":"Calculations!R1028","v":0},{"$f":"Calculations!R1029","v":0}]
[null,"Total Incentive",{"$f":"C33*C34","v":0},{"$f":"D33*D34","v":0},0]
[]
[null,"Incentive Limits"]
[null,"Incentive Capped at 50% Cost",{"$f":"IFERROR(ROUND(C32*0.5,2),\"\")","v":0},{"$f":"IFERROR(ROUND(D32*0.5,2),\"\")","v":0},0]
[null,"Incentive Capped at $300,000",{"$f":"MIN(C35,300000)","v":0},{"$f":"MIN(D35,300000)","v":0},0]
[null,"Incentive Based on Energy Savings",{"$f":"IFERROR(C35,\"\")","v":0},{"$f":"IFERROR(D35,\"\")","v":0},0]
[null,"Final Incentive",{"$f":"MIN(C38:C40)","v":0},{"$f":"MIN(D38:D40)","v":0},{"$f":"MIN(E38:E40)","v":0}]
[]
[null,"Estimated Annual Cost Savings",{"$f":"IFERROR(C24*$D$52,0)","v":0},{"$f":"IFERROR(D24*$D$52,0)","v":0},{"$f":"IFERROR(E24*$D$52,0)","v":0}]
[null,"Simple Payback without Incentive",{"$f":"ROUND(IFERROR(C32/C43,0),2)","v":{"v":0,"d":"0.00"}},{"$f":"ROUND(IFERROR(D32/D43,0),2)","v":{"v":0,"d":"0.00"}},{"v":0,"d":"0.00"}]
[null,"Simple Payback with Incentive",{"$f":"ROUND(IFERROR((C32-C41)/C43,0),2)","v":{"v":0,"d":"0.00"}},{"$f":"ROUND(IFERROR((D32-D41)/D43,0),2)","v":{"v":0,"d":"0.00"}},{"v":0,"d":"0.00"}]
[]
[]
[null,"Price Data"]
[null,"EIA WI Yearly Electricity Price Data",null,null,"          Copy of EIA Data:"]
[null,"https://www.eia.gov/electricity/data/browser/#/topic/7?agg=0,1&geo=00001&endsec=vg&linechart=ELEC.PRICE.WI-ALL.M&columnchart=ELEC.PRICE.WI-ALL.M&map=ELEC.PRICE.WI-ALL.M&freq=M&start=202101&end=202203&ctype=linechart&ltype=pin&rtype=s&pin=&rse=0&maptype=0"]
[null,"Usage Profile",null,"Dollars per kWh"]
[null,"Interior or 24/7 (On-Peak)","Commercial",{"v":0.1109,"d":"$0.1109"}]
[null,null,"Industrial",{"v":0.0776,"d":"$0.0776"}]
[null,null,"Residential",{"v":0.1587,"d":"$0.1587"},"Accessed Jun 23 2022"]
[null,"Exterior (Off-Peak)",null,{"v":0.08,"d":"$0.0800"}]