{"text_format":"3","workbook":"xlsx","n_sheets":10,"sheets":["Start Here!"," Requirements COMcheck","As-Built COMcheck"," Requirements Individual Files","Sq. Ft. Area Individual Files","Fixture List Individual Files","FixturesByArea Individual Files","Helpful Tips","RevisionHistory","Admin_Lists"],"not_rendered":{"images":18,"macros":1,"defined_names":31,"comments":2},"read":"whole","date_system":"1900"}

{"sheet":"Start Here!","index":0,"n_rows":60,"n_cols":33,"rows_kept":60,"merged":[[0,1,3,3],[4,1,4,11],[4,19,4,22],[4,23,4,24],[4,25,4,26],[5,1,5,2],[5,19,5,22],[5,23,5,26],[6,1,6,2],[6,14,6,15],[6,19,6,22],[6,23,6,26],[7,3,7,11],[7,19,8,22],[7,23,8,26],[8,3,8,11],[9,1,9,11],[9,19,9,22],[9,23,9,26],[10,1,10,2],[10,3,10,11],[10,19,11,22],[10,23,11,26],[11,1,11,2],[11,3,11,11],[12,1,12,2],[12,3,12,5],[12,7,12,8],[12,10,12,11],[12,19,13,22],[12,23,13,26],[13,1,13,2],[13,3,13,11],[14,1,14,2],[14,3,14,11],[14,19,14,22],[14,23,14,26],[15,1,15,2],[15,3,15,11],[15,19,15,22],[15,23,15,26],[16,19,16,22],[16,23,16,26],[17,9,17,11],[18,9,18,10],[19,6,19,7],[19,9,19,10],[20,6,21,7],[20,9,20,10],[21,9,21,10],[22,6,24,7],[22,9,22,10],[23,9,23,11],[26,2,26,11],[55,1,56,1]]}
[null,"Note: this workbook needs to be used in the full version of Excel. Some features won't work in Excel Online. Also, make sure that macros are enabled when you open this workbook (see 'Helpful Tips' tab for directions).",{"$nulls":11},"Hide","Hide","Hide","Hide","Hide","Hide","Hide","Hide","Hide","Hide","Hide","Hide","Hide","Hide","Hide","Hide","Hide","Hide","Hide","Hide"]
[]
[]
[]
[null,"New Construction Interior Lighting Supplemental Workbook",{"$nulls":17},"Program Implementer Check-list:",{"$nulls":3},"Completed by:"]
[{"$nulls":19},"If other than Default HOU, note source"]
[null,"Start Here:",{"$nulls":8},"Do you have a completed As-built COMcheck using 2021 IECC or AHRAE 90.1-2019? ","Select Yes or No",null,null,"MMID 4948 (LPD) SPECTRUM entry:",{"$nulls":4},"COMcheck is 2021 IECC and Reduced Lighting Power not selected"]
[{"$nulls":3},{"$f":"IF(L7=\"Yes\",\"Select 'COMcheck' from the 'I'm providing the required info via:' drop-down below and proceed\",IF(L7=\"No\",\"Select 'Individual Files' from the 'I'm providing the required info via:' drop-down below and proceed\",IF(L7=\"Select Yes or No\",\" \")))","v":" "},{"$nulls":10},"Unit of Measure Answer",{"$f":"Z54","v":0},"net KWh reduced all areas",null,null,"Signed off by a Professional  (COMcheck, Floorplan and/or Lighting Layout) -or- QPLs provided for most fixtures installed"]
[{"$nulls":3},{"$f":"IF(L7=\"Yes\",\"Note: COMcheck's should not include 'Reduced Lighting Power' Efficiency Package.\",\"\")","v":""},{"$nulls":10},"Units",1]
[null,"Complete all fields below along with corresponding tabs. The incentive will be populated once all required information has been provided.",{"$nulls":12},"Measure Cost",{"$f":"AB54","v":0},{"$f":"\"$\" & FIXED(LPD_IndustryStandardCostPerSqFt,2) & \"*sq. ft. or Tech Review override (manual entry)\"","v":"$0.90*sq. ft. or Tech Review override (manual entry)"},null,null,"Confirm/Call-out/Note Source of Square Footage"]
[null,"Customer:",{"$nulls":12},"Summer kW Savings",{"$f":"U54","v":{"v":0,"d":"0.0000"}},{"$nulls":3},"Spot check top 3 qty of fixtures to ensure quantity alignment. \n\"COMcheck v. Invoice / Fixt List v. Invoice\""]
[null,"Trade Ally/Installer:",{"$nulls":12},"Winter kW Savings",{"$f":"V54","v":{"v":0,"d":"0.0000"}},"net savings all areas"]
[null,"Best Contact for LPD Questions:",{"$nulls":4},"Email:",null,null,"Phone:",{"$nulls":4},"kWh Savings (1st Yr)",{"$f":"Z54","v":0},"net savings all areas",null,null,"Spot check top 3 'total wattage of fixtures' (Col. E) to ensure Wattage alignment. \"COMcheck v. Specs / Fixt List v. Specs\""]
[null,"Project Description:",{"$nulls":12},"kWh Savings (Lifecycle)",{"$f":"AA54","v":0},"net savings all areas"]
[null,"Project Completion Date:",{"$nulls":17},"Confirm no Instant Retailer invoices/receipts"]
{"$rows_left_out":46}
{"sheet":" Requirements COMcheck","index":1,"n_rows":0,"n_cols":0,"rows_kept":0,"hidden":true}

{"sheet":"As-Built COMcheck","index":2,"n_rows":167,"n_cols":24,"rows_kept":167,"hidden":true,"merged":[[0,0,3,10],[0,11,0,20],[1,11,2,20],[3,11,4,20],[5,11,5,20],[9,4,10,9],[16,11,18,22],[19,11,20,22],[23,11,24,22],[26,11,30,22],[38,23,38,24],[40,23,40,24],[133,13,134,18],[135,0,147,10],[150,0,169,10]]}
["For data provided via COMcheck report\n - Provide the As-Built COMcheck report\n - If COMcheck lists more than 25 Area Types, contact Focus on Energy for assistance (business@focusonenergy.com)\n - See Helpful Tips tab for directions on inserting files",{"$nulls":10},"Invoices to Support Fixtures Installed"]
[{"$nulls":11}," - Include invoices for all interior fixtures installed (indicate any items \n   on invoice that are not part of the LPD offering)"]
[]
[{"$nulls":11}," - Provide itemized invoices showing quantity and make/model number\n - Include multiple files if appropriate"]
[]
[{"$nulls":11}," - Supply as separate document attachment(s) if file size is prohibitive"]
["Area 1:",null,"Total Sq. Ft:",null,"Found on COMcheck as \"Floor Area (ft2)\""]
[null,null,"Allowed Watts/ft2:",null,"Found on COMcheck as \"Allowed Watts / ft2\"",{"$nulls":6},"Important Reminders for COMcheck Reports"]
[null,null,"Total Allowed Watts:",{"$f":"IFERROR(ROUND(D7*D8,0),\"\")","v":0},"This will calculate",{"$nulls":6},"Must use Energy Code \"2021 IECC\""]
[null,null,"New System Installed Watts:",null,"For Single Area Facility find on COMcheck as Total Proposed\nWatts - For multi-area add all wattage installed in Area 1 "]
[]
["Lines 15-134 used if multiple area types are listed on COMcheck, as indicated under \"Area Category\""]
[]
["Area 2:",null,"Total Sq. Ft:",null,"Found on COMcheck as \"Floor Area (ft2)\""]
[null,null,"Allowed Watts/ft2:",null,"Found on COMcheck as \"Allowed Watts / ft2\""]
{"$rows_left_out":153}
{"sheet":" Requirements Individual Files","index":3,"n_rows":0,"n_cols":0,"rows_kept":0,"hidden":true}

{"sheet":"Sq. Ft. Area Individual Files","index":4,"n_rows":33,"n_cols":9,"rows_kept":33,"hidden":true,"merged":[[0,0,4,3],[7,5,10,9],[13,5,14,9],[15,5,20,9]]}
["Documentation Showing As-Built Square Footage\n - Floorplan layout must include dimensions\n - Include multiple files if appropriate\n - Supply as separate document attachment(s) if file size is prohibitive\n - See Helpful Tips tab for help inserting files"]
[]
[]
[]
[]
[]
[null,null,"Sq. Ft.","Describe Area",null,"Insert floorplan PDF(s) here:"]
[null,null,"Verified by floorplan layout"," (ex.: Warehouse, Offices, etc.)"]
[null,"Area 1:"]
[null,"Area 2:"]
[null,"Area 3:"]
[null,"Area 4:"]
[null,"Area 5:"]
[null,"Area 6:",{"$nulls":3},"For Projects with Multiple Area Use Types\n   Ex.: Warehouse (Area 1), Showroom (Area 2) and Offices (Area 3) within same facility\n"]
[null,"Area 7:"]
{"$rows_left_out":19}
{"sheet":"Fixture List Individual Files","index":5,"n_rows":63,"n_cols":17,"rows_kept":63,"hidden":true,"merged":[[0,5,0,9],[1,1,1,4],[1,5,2,9],[2,1,2,4],[3,1,3,4],[3,5,3,9],[4,5,4,9],[5,5,5,9],[6,5,6,9],[7,5,10,9],[9,1,9,4],[10,1,10,4],[11,12,11,16]]}
["List of ALL Interior fixtures installed, along with documentation of installed fixture wattage. ",{"$nulls":4},"Invoices to Support Fixtures Installed"]
["-","Acceptable forms of wattage documentation: ",{"$nulls":3}," - Include invoices for all interior fixtures installed (indicate any items \n   on invoice that are not part of the LPD offering)"]
[null,"ENERGY STAR or DLC SSL QPL listings and/or Manufacturer's specs.\n"]
["-","Do not include Exterior fixtures, or emergency / exit lights.\n",{"$nulls":3}," - Provide itemized invoices showing quantity and make/model number\n - Include multiple files if appropriate"]
["-","For fixture wattage, enter wattage to 1 or 2 decimals, however it is shown on the spec sheet. ",{"$nulls":3}," - Supply as separate document attachment(s) if file size is prohibitive"]
["-","All data should be per As-Built conditions. "]
[null,"If discrepancies are found in review (fixtures listed, invoicing, in-person inspection), will use higher value.",{"$nulls":3},"Insert shared spec sheet, DLC/ENERGY STAR, and Invoice PDFs here:"]
["-","Installed lamps purchased at participating instant discount retailers disqualify the LPD measure."]
["-","See Helpful Tips tab for help inserting files"]
[]
[]
[{"$nulls":12},"Example"]
[null,"Fixture Mark","Fixture Name","Fixture Watts","Spec Sheet","DLC or ENERGY STAR Listing (If Applicable)","Invoice","Total Fixture Count (All Spaces)",{"$nulls":4},"Fixture Mark","Fixture\nName",null,"Fixture Watts","Fixture\nCount"]
[{"$nulls":7},{"$f":"SUMIF('FixturesByArea Individual Files'!$B$10:$B$563,B14,'FixturesByArea Individual Files'!$D$10:$D$563)+SUMIF('FixturesByArea Individual Files'!$J$10:$J$563,B14,'FixturesByArea Individual Files'!$L$10:$L$563)","v":0},{"$nulls":4},"HB","Lithonia High Bay IBG 24000 LM SEF AFL",null,150,4]
[{"$nulls":7},{"$f":"SUMIF('FixturesByArea Individual Files'!$B$10:$B$563,B15,'FixturesByArea Individual Files'!$D$10:$D$563)+SUMIF('FixturesByArea Individual Files'!$J$10:$J$563,B15,'FixturesByArea Individual Files'!$L$10:$L$563)","v":0},{"$nulls":4},"SC","Lithonia CLX L96 6000LM SEF RDL ",null,49,10]
{"$rows_left_out":49}
{"sheet":"FixturesByArea Individual Files","index":6,"n_rows":564,"n_cols":20,"rows_kept":564,"hidden":true,"merged":[[6,1,6,5],[6,9,6,13],[7,15,8,15],[7,16,8,16],[7,17,8,17],[7,18,8,18],[7,19,8,19],[8,2,8,5],[8,10,8,13],[9,1,10,1],[9,2,10,2],[9,3,10,3],[9,4,10,4],[9,5,10,5],[9,9,10,9],[9,10,10,10],[9,11,10,11],[9,12,10,12],[9,13,10,13],[49,1,49,5],[49,9,49,13],[51,2,51,5],[51,10,51,13],[52,1,53,1],[52,2,53,2],[52,3,53,3],[52,4,53,4],[52,5,53,5],[52,9,53,9],[52,10,53,10],[52,11,53,11],[52,12,53,12],[52,13,53,13],[92,1,92,5],[92,9,92,13],[94,2,94,5],[94,10,94,13],[95,1,96,1],[95,2,96,2],[95,3,96,3],[95,4,96,4],[95,5,96,5],[95,9,96,9],[95,10,96,10],[95,11,96,11],[95,12,96,12],[95,13,96,13],[135,1,135,5],[135,9,135,13],[137,2,137,5],[137,10,137,13],[138,1,139,1],[138,2,139,2],[138,3,139,3],[138,4,139,4],[138,5,139,5],[138,9,139,9],[138,10,139,10],[138,11,139,11],[138,12,139,12],[138,13,139,13],[178,1,178,5],[178,9,178,13],[180,2,180,5],[180,10,180,13],[181,1,182,1],[181,2,182,2],[181,3,182,3],[181,4,182,4],[181,5,182,5],[181,9,182,9],[181,10,182,10],[181,11,182,11],[181,12,182,12],[181,13,182,13],[221,1,221,5],[221,9,221,13],[223,2,223,5],[223,10,223,13],[224,1,225,1],[224,2,225,2],[224,3,225,3],[224,4,225,4],[224,5,225,5],[224,9,225,9],[224,10,225,10],[224,11,225,11],[224,12,225,12],[224,13,225,13],[264,1,264,5],[264,9,264,13],[266,2,266,5],[266,10,266,13],[267,1,268,1],[267,2,268,2],[267,3,268,3],[267,4,268,4],[267,5,268,5],[267,9,268,9],[267,10,268,10],[267,11,268,11],[267,12,268,12],[267,13,268,13],[307,1,307,5],[307,9,307,13],[309,2,309,5],[309,10,309,13],[310,1,311,1],[310,2,311,2],[310,3,311,3],[310,4,311,4],[310,5,311,5],[310,9,311,9],[310,10,311,10],[310,11,311,11],[310,12,311,12],[310,13,311,13],[350,1,350,5],[350,9,350,13],[352,2,352,5],[352,10,352,13],[353,1,354,1],[353,2,354,2],[353,3,354,3],[353,4,354,4],[353,5,354,5],[353,9,354,9],[353,10,354,10],[353,11,354,11],[353,12,354,12],[353,13,354,13],[393,1,393,5],[393,9,393,13],[395,2,395,5],[395,10,395,13],[396,1,397,1],[396,2,397,2],[396,3,397,3],[396,4,397,4],[396,5,397,5],[396,9,397,9],[396,10,397,10],[396,11,397,11],[396,12,397,12],[396,13,397,13],[436,1,436,5],[436,9,436,13],[438,2,438,5],[438,10,438,13],[439,1,440,1],[439,2,440,2],[439,3,440,3],[439,4,440,4],[439,5,440,5],[439,9,440,9],[439,10,440,10],[439,11,440,11],[439,12,440,12],[439,13,440,13],[479,1,479,5],[479,9,479,13],[481,2,481,5],[481,10,481,13],[482,1,483,1],[482,2,483,2],[482,3,483,3],[482,4,483,4],[482,5,483,5],[482,9,483,9],[482,10,483,10],[482,11,483,11],[482,12,483,12],[482,13,483,13],[522,1,522,5],[524,2,524,5],[526,1,527,1],[526,2,527,2],[526,3,527,3],[526,4,527,4],[526,5,527,5]]}
["List of ALL Interior fixtures (including quantity) in the area(s) where they were installed. "]
["-","Do not include Exterior fixtures, or emergency / exit lights."]
["-","All data should be per As-Built conditions. If discrepancies are found in review (fixtures listed, invoicing, in-person inspection), will use higher value."]
["-","Choose Area Type(s) best describing the use of space."]
["-","If \"Other-Identify\" is chosen, note on Start Here! Tab in \"Project Notes\"- The LPD calculation/incentive will be calculated upon review."]
[{"$nulls":15},"Example"]
[null,"Area 1",{"$nulls":7},"Area 2",{"$nulls":5},"Type:","Warehouse",null,null,0.66]
[null,"Type:","Choose from Drop-down",null,null,{"$f":"IFERROR(VLOOKUP(C8,Admin_Lists!$A$9:$B$41,2,FALSE),\"\")","v":0},"W/sq ft",null,null,"Type:","Choose from Drop-down",null,null,{"$f":"IFERROR(VLOOKUP(K8,Admin_Lists!$A$9:$B$41,2,FALSE),\"\")","v":0},"W/sq ft","Fixture Mark","Fixture\nName","Fixture\nCount","Fixture Watts","Total Watts \n(Fixt Count x Fixt Watts)"]
[null,null,{"$f":"\"Area Description: \"&'Sq. Ft. Area Individual Files'!D9","v":"Area Description: "},{"$nulls":7},{"$f":"\"Area Description: \"&'Sq. Ft. Area Individual Files'!D10","v":"Area Description: "}]
[null,"Fixture Mark","Fixture\nName","Fixture\nCount","Fixture Watts","Total Watts \n(Fixt Count x Fixt Watts)",{"$nulls":3},"Fixture Mark","Fixture\nName","Fixture\nCount","Fixture Watts","Total Watts \n(Fixt Count x Fixt Watts)",null,"HB","Lithonia High Bay IBG 240000 LM SEF AFL",4,150,{"$f":"R10*S10","v":600}]
[{"$nulls":15},"SC","Lithonia CLX L96 6000LM SEF RDL ",10,49,490]
[null,null,{"$f":"IF(B12=\"\",\"\",VLOOKUP(B12,'Fixture List Individual Files'!$B$14:$D$63,2,FALSE))","v":""},null,{"$f":"IF(B12=\"\",\"\",VLOOKUP(B12,'Fixture List Individual Files'!$B$14:$D$63,3,FALSE))","v":""},{"$f":"IF(E12=\"\",\"\",D12*E12)","v":""},{"$nulls":4},{"$f":"IF(J12=\"\",\"\",VLOOKUP(J12,'Fixture List Individual Files'!$B$14:$D$63,2,FALSE))","v":""},null,{"$f":"IF(J12=\"\",\"\",VLOOKUP(J12,'Fixture List Individual Files'!$B$14:$D$63,3,FALSE))","v":""},{"$f":"IF(M12=\"\",\"\",L12*M12)","v":""},null,"LS4.64","Lithonia Surface Mounted",251,55,13805]
[null,null,{"$f":"IF(B13=\"\",\"\",VLOOKUP(B13,'Fixture List Individual Files'!$B$14:$D$63,2,FALSE))","v":""},null,{"$f":"IF(B13=\"\",\"\",VLOOKUP(B13,'Fixture List Individual Files'!$B$14:$D$63,3,FALSE))","v":""},{"$f":"IF(E13=\"\",\"\",D13*E13)","v":""},{"$nulls":4},{"$f":"IF(J13=\"\",\"\",VLOOKUP(J13,'Fixture List Individual Files'!$B$14:$D$63,2,FALSE))","v":""},null,{"$f":"IF(J13=\"\",\"\",VLOOKUP(J13,'Fixture List Individual Files'!$B$14:$D$63,3,FALSE))","v":""},{"$f":"IF(M13=\"\",\"\",L13*M13)","v":""},null,"LS4.47","Lithonia Surface Mounted",359,43,15437]
[null,null,{"$f":"IF(B14=\"\",\"\",VLOOKUP(B14,'Fixture List Individual Files'!$B$14:$D$63,2,FALSE))","v":""},null,{"$f":"IF(B14=\"\",\"\",VLOOKUP(B14,'Fixture List Individual Files'!$B$14:$D$63,3,FALSE))","v":""},"",{"$nulls":4},{"$f":"IF(J14=\"\",\"\",VLOOKUP(J14,'Fixture List Individual Files'!$B$14:$D$63,2,FALSE))","v":""},null,{"$f":"IF(J14=\"\",\"\",VLOOKUP(J14,'Fixture List Individual Files'!$B$14:$D$63,3,FALSE))","v":""},"",null,"LS4.5","Lithonia Surface Mounted",1,43,43]
[null,null,{"$f":"IF(B15=\"\",\"\",VLOOKUP(B15,'Fixture List Individual Files'!$B$14:$D$63,2,FALSE))","v":""},null,{"$f":"IF(B15=\"\",\"\",VLOOKUP(B15,'Fixture List Individual Files'!$B$14:$D$63,3,FALSE))","v":""},"",{"$nulls":4},{"$f":"IF(J15=\"\",\"\",VLOOKUP(J15,'Fixture List Individual Files'!$B$14:$D$63,2,FALSE))","v":""},null,{"$f":"IF(J15=\"\",\"\",VLOOKUP(J15,'Fixture List Individual Files'!$B$14:$D$63,3,FALSE))","v":""},"",null,"LSW4","GE Wall Mounted",2,48,96]
{"$rows_left_out":550}
{"sheet":"Helpful Tips","index":7,"n_rows":43,"n_cols":11,"rows_kept":43}
["Helpful Tips"]
[]
["How to Enable Macros"]
["1. When you open the workbook, look just above the formula bar for a yellow shaded row that looks like this: "]
["2. If this appears, click the \"Enable Content\" button"]
["3. Generally, should only have to do this the first time you open the workbook. If you download a new copy from "]
["    the Focus website or have additional staff access the workbook, will likely need to do this again. "]
[]
[]
[]
["How to Embed (insert) a PDF File in an Excel Worksheet",{"$nulls":9},"1)"]
["1. Go to Insert tab and click on the Object icon in the Text group. ..."]
["2. In the Object dialog box, select the 'Create New' tab and the select 'Adobe Acrobat Document' from the list. ..."]
["3. Check the option – 'Display as icon'."]
["4. If desired, select \"Change Icon\" to modify the file name displayed (ex: Installation invoice, COMcheckv1, etc.).  "]
{"$rows_left_out":18}
{"sheet":"RevisionHistory","index":8,"n_rows":30,"n_cols":4,"rows_kept":30,"hidden":true}
[]
[]
["Version History"]
["Program Year","Date of Revision","Description of Changes","Updated By:"]
[2021,"2021-01-01","Initial version"]
[2021,"2021-02-27","Added Tech Review calc, SPECTRUM entry, checklist. Fixed rounding errors. Added \"area description\" on individual files tab. Fixed protection to allow inserting pages","Trish"]
[2021,"2021-03-02","Corrected rounding issues on Start Here! Tab in columns J and H and R thru Y in savings table","Melissa"]
[2021,"2021-03-18","Changed algorithms in cells S4-S47 to reference only one cell for CF lookup. Also, removed colon (\":\") at the end of the facility type names (cells J14-J19) to aide proper lookup for CF","Zishan"]
[2021,"2021-03-25","Removed ROUNDDOWN function and added ROUND to cells H23-H27, J23-J27, R42-R47 and W42-W47 in \"Start Here!\" tab. Also added ROUND function to round allowed watts in \"As-Built COMcheck\" tab","Zishan"]
[2021,"2021-03-26","Added algorithm to correctly pull CF in O38"]
[2021,"2021-03-26","Conditional format HOU on Start Here tab. Add LPD reference table on As-Built COMcheck tab. Add note about more than 5 area types on As-Built COMcheck tab. Formatted Indiv. Files Sq Ft by area to be reflected on Fixt List tab.","Trish"]
[2021,"2021-04-07","Added 'qualify the project' section to Start here tab","Trish"]
[2021,"2021-04-12","Added \"Annual\" to Hours of use in sds table. Revised formatting of lines on COMcheck tab, and added consistent verbiage to \"more than 5 areas topic\" on COMcheck tab. Updated the utility $/therm, #/kWh to 2019","Trish"]
[2021,"2021-05-17","Corrected units for kWh (annual and lifecycle) on Start Here! tab summary table ","Todd"]
[2021,"2021-07-19","Updated list of credentials for lighting designers","Melissa"]
{"$rows_left_out":16}
{"sheet":"Admin_Lists","index":9,"n_rows":88,"n_cols":8,"rows_kept":88,"hidden":true,"merged":[[6,0,7,1],[8,14,9,15],[43,0,44,0]]}
[]
[null,"Type"]
[null,"Choose from Drop-down",null,"<==The items in this list are named ComCheck"]
[null,"COMcheck",null,"To name the data cells, select them, click in the Name Box"]
[null,"Individual Files",null,"Add more words to the list, and the list will expand to include them"]
[]
["LIGHTING POWER DENSITY\n(AREA METHOD)",{"$nulls":6},"Space by Space Reference for Tech Review, not part of drop-down options"]
[]
["Choose from Drop-down",0]
["Automotive Facility",0.75]
["Convention Center",0.64]
["Court House",0.79]
["Dining: Bar Lounge/Leisure",0.8]
["Dining: Cafeteria/Fast Food",0.76]
["Dining: Family",0.71]
{"$rows_left_out":73}